measnum,projsym,mpdsector,seriestype,keymeasnum,varname,descrip,descrip2,units,datatype,magnitude,method,intervention,paneldesc,sextested,ageweeks,granularity,sourceparm,projyear,extname,reference,association,nstrainstested,listorder,label,supplemental,native_method,is_covar,is_measure,upload_factors,file_column,is_baseline,is_control,private,strain,sex,mean,sd,nmice,zscore
42402,Donahue15,css,,42402,litter_interval,mean litter interval,,wks,,,colony observation,,BXH,f,3-55wks,animal,,2011,,,,11,2,,,,,True,,,False,False,,BXH20/KccJ,f,4.47,0.925,8,-0.87
42403,Donahue15,css,,42403,litter_size_birth,mean number of pups born,,n,,,colony observation,,BXH,f,3-55wks,animal,,2011,,,,11,3,,,,,True,,,False,False,,BXH20/KccJ,f,4.85,0.619,8,0.06
42404,Donahue15,css,,42404,litter_size_wean,mean number of pups weaned,,n,,,colony observation,,BXH,f,3-55wks,animal,,2011,,,,11,4,,,,,True,,,False,False,,BXH20/KccJ,f,3.51,0.808,8,-0.95
42405,Donahue15,css,,42405,ratio_wean_born,ratio of pups weaned to pups born,,ratio,,,colony observation,,BXH,f,3-55wks,animal,,2011,,,,11,5,,,,,True,,,False,False,,BXH20/KccJ,f,0.663,0.106,8,-2.32
42406,Donahue15,css,,42406,fecundity_index,mean litter size divided by mean litter interval,,n/wks,,,colony observation,,BXH,f,3-55wks,animal,,2011,,,,11,6,,,,,True,,,False,False,,BXH20/KccJ,f,1.11,0.196,8,0.44
42407,Donahue15,css,,42407,pct_Fwean,percent females at weaning,,%,,,colony observation,,BXH,f,3-55wks,animal,,2011,,,,11,7,,,,,True,,,False,False,,BXH20/KccJ,f,47.0,5.95,8,-0.68
44601,HMDPpheno1,css,,44601,BMD_body,"whole body bone mineral density (BMD; skull, lumbar spine, left femur excluded)",,g/cm<sup>2</sup>,,,DXA,,HMDP w/par,m,16wks,animal,,2011,,,,96,1,,,,,True,,,False,False,,BXH20/KccJ,m,0.0524,0.00259,11,0.90
44602,HMDPpheno1,css,,44602,BMD_femur,bone mineral density (BMD) of left femur,,g/cm<sup>2</sup>,,,DXA,,HMDP w/par,m,16wks,animal,,2011,,,,96,2,,,,,True,,,False,False,,BXH20/KccJ,m,0.0837,0.00656,11,0.81
44603,HMDPpheno1,css,,44603,BMD_spine,bone mineral density (BMD) of lumbar spine,,g/cm<sup>2</sup>,,,DXA,,HMDP w/par,m,16wks,animal,,2011,,,,96,3,,,,,True,,,False,False,,BXH20/KccJ,m,0.0598,0.00275,11,0.53
46401,HMDPpheno2,css,,46401,HDL,HDL cholesterol (plasma HDL),,mg/dL,,,lipid profile,,HMDP w/par,m,16wks,animal,,2010,,,,99,1,,,,,True,,,False,False,,BXH20/KccJ,m,109,12.1,8,0.61
46402,HMDPpheno2,css,,46402,LDL_VLDL,low density lipoprotein (plasma LDL) plus very low density lipoprotein (plasma VLDL),,mg/dL,,,lipid profile,,HMDP w/par,m,16wks,animal,,2010,,,,99,2,,,,,True,,,False,False,,BXH20/KccJ,m,20.5,5.24,8,-0.16
46403,HMDPpheno2,css,,46403,CHOL_un,unesterified cholesterol (plasma CHOL),,mg/dL,,,lipid profile,,HMDP w/par,m,16wks,animal,,2010,,,,99,3,,,,,True,,,False,False,,BXH20/KccJ,m,31.9,5.74,8,0.95
46404,HMDPpheno2,css,,46404,CHOL_tot,total cholesterol (plasma CHOL),,mg/dL,,,lipid profile,,HMDP w/par,m,16wks,animal,,2010,,,,99,4,,,,,True,,,False,False,,BXH20/KccJ,m,130,15.1,8,0.38
46405,HMDPpheno2,css,,46405,FFA,free fatty acids (plasma FFA),,mEq/L,,,lipid profile,,HMDP w/par,m,16wks,animal,,2010,,,,99,5,,,,,True,,,False,False,,BXH20/KccJ,m,57.1,14.1,8,0.50
46406,HMDPpheno2,css,,46406,TG,"triglycerides (plasma TG, 16h fast)",,mg/dL,,,lipid profile,,HMDP w/par,m,16wks,animal,,2010,,,,99,6,,,,,True,,,False,False,,BXH20/KccJ,m,56.2,17.5,8,-0.01
46407,HMDPpheno2,css,,46407,pct_fat,"percentage of tissue mass that is fat, whole body with head (NMR)",,%,,,NMR,,HMDP w/par,m,16wks,animal,,2010,,,,99,7,,,,,True,,,False,False,,BXH20/KccJ,m,10.1,1.99,8,-0.74
46801,HMDPpheno4,css,series,46801,ftr_pre_thig,"fear training, percent time spent near chamber walls, day1",pre-stimulus,%,,,fear conditioning test,,HMDP w/par,m,10wks,animal,,2011,,,,94,1,pre-stimulus,,,,True,,,False,False,,BXH20/KccJ,m,47.5,8.29,6,-0.65
46802,HMDPpheno4,css,series,46801,ftr_post_thig,"fear training, percent time spent near chamber walls, day1",post-stimulus,%,,,fear conditioning test,,HMDP w/par,m,10wks,animal,,2011,,,,94,2,post-stimulus,,,,True,,,False,False,,BXH20/KccJ,m,60.1,24.2,6,-0.73
46811,HMDPpheno4,css,series,46811,ftr_pre_vel,"fear training, velocity, day 1",pre-stimulus,cm/s,,,fear conditioning test,,HMDP w/par,m,10wks,animal,,2011,,,,94,11,pre-stimulus,,,,True,,,False,False,,BXH20/KccJ,m,7.43,0.736,6,1.73
46812,HMDPpheno4,css,series,46811,ftr_post_vel,"fear training, velocity, day 1",post-stimulus,cm/s,,,fear conditioning test,,HMDP w/par,m,10wks,animal,,2011,,,,94,12,post-stimulus,,,,True,,,False,False,,BXH20/KccJ,m,4.19,0.763,6,0.49
46821,HMDPpheno4,css,series,46821,ftr_pre_imob,"fear training, percent time immobile, day 1",pre-stimulus,%,,,fear conditioning test,,HMDP w/par,m,10wks,animal,,2011,,,,94,21,pre-stimulus,,,,True,,,False,False,,BXH20/KccJ,m,7.36,3.45,6,-0.79
46822,HMDPpheno4,css,series,46821,ftr_post_imob,"fear training, percent time immobile, day 1",post-stimulus,%,,,fear conditioning test,,HMDP w/par,m,10wks,animal,,2011,,,,94,22,post-stimulus,,,,True,,,False,False,,BXH20/KccJ,m,36.4,8.22,6,0.50
46831,HMDPpheno4,css,,46831,ftr_post_act_burst,"fear training activity burst to footshock, shock reactivity, day 1",,cm/s,,,fear conditioning test,,HMDP w/par,m,10wks,animal,,2011,,,,94,31,,,,,True,,,False,False,,BXH20/KccJ,m,50.1,16.7,6,1.26
46836,HMDPpheno4,css,,46836,ctx_thig,"contextual fear thigmotaxis, percent time spent near chamber walls, day 2",,%,,,fear conditioning test,,HMDP w/par,m,10wks,animal,,2011,,,,94,36,,,,,True,,,False,False,,BXH20/KccJ,m,54.8,29.0,6,-0.44
46841,HMDPpheno4,css,,46841,ctx_vel,"contextual fear velocity, day 2",,cm/s,,,fear conditioning test,,HMDP w/par,m,10wks,animal,,2011,,,,94,41,,,,,True,,,False,False,,BXH20/KccJ,m,2.53,0.599,6,-0.93
46846,HMDPpheno4,css,,46846,ctx_imob,"contextual fear percent time immobile, day 2",,%,,,fear conditioning test,,HMDP w/par,m,10wks,animal,,2011,,,,94,46,,,,,True,,,False,False,,BXH20/KccJ,m,58.8,9.16,6,1.62
46851,HMDPpheno4,css,series,46851,precue_thig,"cued fear thigmotaxis, percent time spent near chamber walls, day 3",pre-cue,%,,,fear conditioning test,,HMDP w/par,m,10wks,animal,,2011,,,,94,51,pre-cue,,,,True,,,False,False,,BXH20/KccJ,m,57.2,14.1,6,-1.95
46852,HMDPpheno4,css,series,46851,cue_thig,"cued fear thigmotaxis, percent time spent near chamber walls, day 3",cue,%,,,fear conditioning test,,HMDP w/par,m,10wks,animal,,2011,,,,94,52,cue,,,,True,,,False,False,,BXH20/KccJ,m,59.8,8.23,6,-0.96
46861,HMDPpheno4,css,series,46861,precue_vel,"cued fear, velocity, day 3",pre-cue,cm/s,,,fear conditioning test,,HMDP w/par,m,10wks,animal,,2011,,,,94,61,pre-cue,,,,True,,,False,False,,BXH20/KccJ,m,4.98,0.909,6,0.94
46862,HMDPpheno4,css,series,46861,cue_vel,"cued fear, velocity, day 3",cue,cm/s,,,fear conditioning test,,HMDP w/par,m,10wks,animal,,2011,,,,94,62,cue,,,,True,,,False,False,,BXH20/KccJ,m,1.06,0.366,6,1.12
46871,HMDPpheno4,css,series,46871,precue_imob,"cued fear, percent time immobile, day 3",pre-cue,%,,,fear conditioning test,,HMDP w/par,m,10wks,animal,,2011,,,,94,71,pre-cue,,,,True,,,False,False,,BXH20/KccJ,m,4.36,2.33,6,-1.53
46872,HMDPpheno4,css,series,46871,cue_imob,"cued fear, percent time immobile, day 3",cue,%,,,fear conditioning test,,HMDP w/par,m,10wks,animal,,2011,,,,94,72,cue,,,,True,,,False,False,,BXH20/KccJ,m,4.35,1.98,6,-1.90
48901,HMDPpheno5,css,,48901,WBC,white blood cell count (WBC; units per volume x 10<sup>3</sup>),,n/&micro;L,,3,complete blood count,,HMDP w/par,m,16wks,animal,,2013,,,,79,1,,,,,True,,,False,False,,BXH20/KccJ,m,3.00,0.424,2,-0.29
48907,HMDPpheno5,css,,48907,LYM,lymphocyte count (LYM; units per volume x 10<sup>3</sup>),,n/&micro;L,,3,complete blood count,,HMDP w/par,m,16wks,animal,,2013,,,,79,7,,,,,True,,,False,False,,BXH20/KccJ,m,1.95,0.0707,2,-0.37
48913,HMDPpheno5,css,,48913,pct_LYM,lymphocyte differential (LYM; percentage of viable WBC),,%,,,complete blood count,,HMDP w/par,m,16wks,animal,,2013,,,,79,13,,,,,True,,,False,False,,BXH20/KccJ,m,66.4,5.09,2,-0.49
48919,HMDPpheno5,css,,48919,MONO,monocyte count (MONO; units per volume x 10<sup>3</sup>),,n/&micro;L,,3,complete blood count,,HMDP w/par,m,16wks,animal,,2013,,,,79,19,,,,,True,,,False,False,,BXH20/KccJ,m,0.300,0.141,2,-0.01
48925,HMDPpheno5,css,,48925,pct_MONO,monocyte differential (MONO; percentage of viable WBC),,%,,,complete blood count,,HMDP w/par,m,16wks,animal,,2013,,,,79,25,,,,,True,,,False,False,,BXH20/KccJ,m,6.85,1.06,2,-0.06
48931,HMDPpheno5,css,,48931,GRA,granulocyte count (GRA; units per volume x 10<sup>3</sup>),,n/&micro;L,,3,complete blood count,,HMDP w/par,m,16wks,animal,,2013,,,,79,31,,,,,True,,,False,False,,BXH20/KccJ,m,0.750,0.212,2,-0.09
48937,HMDPpheno5,css,,48937,pct_GRA,granulocyte differential (GRA; percentage of total viable WBC),,%,,,complete blood count,,HMDP w/par,m,16wks,animal,,2013,,,,79,37,,,,,True,,,False,False,,BXH20/KccJ,m,26.8,4.03,2,0.62
48943,HMDPpheno5,css,,48943,RBC,red blood cell count (RBC; units per volume x 10<sup>6</sup>),,n/&micro;L,,6,complete blood count,,HMDP w/par,m,16wks,animal,,2013,,,,83,43,,,,,True,,,False,False,,BXH20/KccJ,m,7.24,0.495,2,-0.77
48949,HMDPpheno5,css,,48949,MCV,mean RBC corpuscular volume (MCV),,fL,,,complete blood count,,HMDP w/par,m,16wks,animal,,2013,,,,83,49,,,,,True,,,False,False,,BXH20/KccJ,m,44.0,0.0707,2,-0.11
48955,HMDPpheno5,css,,48955,RDW,RBC corpuscular distribution width (RDW),,%,,,complete blood count,,HMDP w/par,m,16wks,animal,,2013,,,,83,55,,,,,True,,,False,False,,BXH20/KccJ,m,16.9,0,2,-0.09
48961,HMDPpheno5,css,,48961,MCH,mean RBC corpuscular hemoglobin (MCH),,pg,,,complete blood count,,HMDP w/par,m,16wks,animal,,2013,,,,83,61,,,,,True,,,False,False,,BXH20/KccJ,m,16.2,0.141,2,1.30
48967,HMDPpheno5,css,,48967,MCHC,mean RBC corpuscular hemoglobin concentration (MCHC),,g/dL,,,complete blood count,,HMDP w/par,m,16wks,animal,,2013,,,,83,67,,,,,True,,,False,False,,BXH20/KccJ,m,36.9,0.424,2,0.86
48973,HMDPpheno5,css,,48973,HGB,hemoglobin (HGB),,g/dL,,,complete blood count,,HMDP w/par,m,16wks,animal,,2013,,,,83,73,,,,,True,,,False,False,,BXH20/KccJ,m,11.8,0.919,2,-0.40
48979,HMDPpheno5,css,,48979,HCT,hematocrit (HCT),,%,,,complete blood count,,HMDP w/par,m,16wks,animal,,2013,,,,83,79,,,,,True,,,False,False,,BXH20/KccJ,m,31.8,2.12,2,-0.76
48985,HMDPpheno5,css,,48985,PLT,platelet count (PLT; units per volume x 10<sup>3</sup>),,n/&micro;L,,3,complete blood count,,HMDP w/par,m,16wks,animal,,2013,,,,83,85,,,,,True,,,False,False,,BXH20/KccJ,m,226,1.41,2,-0.56
48991,HMDPpheno5,css,,48991,MPV,mean platelet volume (MPV),,fL,,,complete blood count,,HMDP w/par,m,16wks,animal,,2013,,,,83,91,,,,,True,,,False,False,,BXH20/KccJ,m,6.50,0.283,2,0.70
50101,HMDPpheno6,css,,50101,Ala,"liver alanine (16h fast), relative abundance",,,,,metabolite quantification,,HMDP w/par,m,16wks,animal,,2014,,,,106,1,,,,,True,,,False,False,,BXH20/KccJ,m,93623280,0,1,1.52
50102,HMDPpheno6,css,,50102,Asn,"liver asparagine (16h fast), relative abundance",,,,,metabolite quantification,,HMDP w/par,m,16wks,animal,,2014,,,,106,2,,,,,True,,,False,False,,BXH20/KccJ,m,396160,0,1,0.86
50103,HMDPpheno6,css,,50103,Asp,"liver aspartate (16h fast), relative abundance",,,,,metabolite quantification,,HMDP w/par,m,16wks,animal,,2014,,,,106,3,,,,,True,,,False,False,,BXH20/KccJ,m,14756810,0,1,0.68
50104,HMDPpheno6,css,,50104,beta_Ala,"liver beta-alanine (16h fast), relative abundance",,,,,metabolite quantification,,HMDP w/par,m,16wks,animal,,2014,,,,106,4,,,,,True,,,False,False,,BXH20/KccJ,m,627385,0,1,-0.40
50105,HMDPpheno6,css,,50105,acetyl_Asn,"liver N-acetylasparagine (16h fast), relative abundance",,,,,metabolite quantification,,HMDP w/par,m,16wks,animal,,2014,,,,103,5,,,,,True,,,False,False,,BXH20/KccJ,m,41663,0,1,-1.01
50106,HMDPpheno6,css,,50106,acetyl_Ala,"liver N-acetylalanine (16h fast), relative abundance",,,,,metabolite quantification,,HMDP w/par,m,16wks,animal,,2014,,,,104,6,,,,,True,,,False,False,,BXH20/KccJ,m,20786,0,1,-0.22
50107,HMDPpheno6,css,,50107,aminobutyrate,"liver 2-aminobutyrate (16h fast), relative abundance",,,,,metabolite quantification,,HMDP w/par,m,16wks,animal,,2014,,,,106,7,,,,,True,,,False,False,,BXH20/KccJ,m,1026063,0,1,-0.58
50108,HMDPpheno6,css,,50108,creatine,"liver creatine (16h fast), relative abundance",,,,,metabolite quantification,,HMDP w/par,m,16wks,animal,,2014,,,,106,8,,,,,True,,,False,False,,BXH20/KccJ,m,2778328,0,1,-1.27
50109,HMDPpheno6,css,,50109,AHB,"liver 2-hydroxybutyrate (AHB) (16h fast), relative abundance",,,,,metabolite quantification,,HMDP w/par,m,16wks,animal,,2014,,,,99,9,,,,,True,,,False,False,,BXH20/KccJ,m,132332,0,1,-0.50
50110,HMDPpheno6,css,,50110,Cys,"liver cysteine (16h fast), relative abundance",,,,,metabolite quantification,,HMDP w/par,m,16wks,animal,,2014,,,,106,10,,,,,True,,,False,False,,BXH20/KccJ,m,2438440,0,1,3.04
50111,HMDPpheno6,css,,50111,hypotaurine,"liver hypotaurine (16h fast), relative abundance",,,,,metabolite quantification,,HMDP w/par,m,16wks,animal,,2014,,,,106,11,,,,,True,,,False,False,,BXH20/KccJ,m,1034602,0,1,-0.45
50112,HMDPpheno6,css,,50112,Met,"liver methionine (16h fast), relative abundance",,,,,metabolite quantification,,HMDP w/par,m,16wks,animal,,2014,,,,106,12,,,,,True,,,False,False,,BXH20/KccJ,m,7603856,0,1,0.42
50113,HMDPpheno6,css,,50113,Met_sulf,"liver methionine sulfoxide (16h fast), relative abundance",,,,,metabolite quantification,,HMDP w/par,m,16wks,animal,,2014,,,,104,13,,,,,True,,,False,False,,BXH20/KccJ,m,245853,0,1,0.50
50114,HMDPpheno6,css,,50114,taurine,"liver taurine (16h fast), relative abundance",,,,,metabolite quantification,,HMDP w/par,m,16wks,animal,,2014,,,,106,14,,,,,True,,,False,False,,BXH20/KccJ,m,903633,0,1,-1.33
50115,HMDPpheno6,css,,50115,acetyl_Met,"liver N-acetylmethionine (16h fast), relative abundance",,,,,metabolite quantification,,HMDP w/par,m,16wks,animal,,2014,,,,106,15,,,,,True,,,False,False,,BXH20/KccJ,m,19939,0,1,-0.36
50116,HMDPpheno6,css,,50116,SAH,"liver S-adenosylhomocysteine (SAH) (16h fast), relative abundance",,,,,metabolite quantification,,HMDP w/par,m,16wks,animal,,2014,,,,106,16,,,,,True,,,False,False,,BXH20/KccJ,m,33601,0,1,-0.75
50117,HMDPpheno6,css,,50117,GABA,"liver gamma-aminobutyrate (GABA) (16h fast), relative abundance",,,,,metabolite quantification,,HMDP w/par,m,16wks,animal,,2014,,,,106,17,,,,,True,,,False,False,,BXH20/KccJ,m,594681,0,1,1.22
50118,HMDPpheno6,css,,50118,acetyl_Glu,"liver N-acetylglutamate (16h fast), relative abundance",,,,,metabolite quantification,,HMDP w/par,m,16wks,animal,,2014,,,,106,18,,,,,True,,,False,False,,BXH20/KccJ,m,106182,0,1,-0.42
50119,HMDPpheno6,css,,50119,Gln,"liver glutamine (16h fast), relative abundance",,,,,metabolite quantification,,HMDP w/par,m,16wks,animal,,2014,,,,106,19,,,,,True,,,False,False,,BXH20/KccJ,m,11213962,0,1,-0.25
50120,HMDPpheno6,css,,50120,Glu,"liver glutamate (16h fast), relative abundance",,,,,metabolite quantification,,HMDP w/par,m,16wks,animal,,2014,,,,106,20,,,,,True,,,False,False,,BXH20/KccJ,m,7634968,0,1,1.37
50121,HMDPpheno6,css,,50121,CySSG,"liver cysteine-glutathione disulfide (16h fast), relative abundance",,,,,metabolite quantification,,HMDP w/par,m,16wks,animal,,2014,,,,106,21,,,,,True,,,False,False,,BXH20/KccJ,m,2705007,0,1,0.87
50122,HMDPpheno6,css,,50122,GSH,"liver glutathione, reduced (GSH) (16h fast), relative abundance",,,,,metabolite quantification,,HMDP w/par,m,16wks,animal,,2014,,,,104,22,,,,,True,,,False,False,,BXH20/KccJ,m,273860,0,1,0.11
50123,HMDPpheno6,css,,50123,GSSG,"liver glutathione, oxidized (GSSG) (16h fast), relative abundance",,,,,metabolite quantification,,HMDP w/par,m,16wks,animal,,2014,,,,106,23,,,,,True,,,False,False,,BXH20/KccJ,m,13861493,0,1,0.83
50124,HMDPpheno6,css,,50124,Me_glutathione,"liver S-methylglutathione (16h fast), relative abundance",,,,,metabolite quantification,,HMDP w/par,m,16wks,animal,,2014,,,,106,24,,,,,True,,,False,False,,BXH20/KccJ,m,197894,0,1,0.42
50125,HMDPpheno6,css,,50125,ophthalmate,"liver ophthalmate (16h fast), relative abundance",,,,,metabolite quantification,,HMDP w/par,m,16wks,animal,,2014,,,,106,25,,,,,True,,,False,False,,BXH20/KccJ,m,285996,0,1,-0.75
50126,HMDPpheno6,css,,50126,oxoproline,"liver 5-oxoproline (16h fast), relative abundance",,,,,metabolite quantification,,HMDP w/par,m,16wks,animal,,2014,,,,106,26,,,,,True,,,False,False,,BXH20/KccJ,m,179500,0,1,-0.32
50127,HMDPpheno6,css,,50127,acetyl_Gly,"liver N-acetylglycine (16h fast), relative abundance",,,,,metabolite quantification,,HMDP w/par,m,16wks,animal,,2014,,,,96,27,,,,,True,,,False,False,,BXH20/KccJ,m,100440,0,1,1.59
50128,HMDPpheno6,css,,50128,diMe_Gly,"liver dimethylglycine (16h fast), relative abundance",,,,,metabolite quantification,,HMDP w/par,m,16wks,animal,,2014,,,,96,28,,,,,True,,,False,False,,BXH20/KccJ,m,195457,0,1,-0.48
50129,HMDPpheno6,css,,50129,Gly,"liver glycine (16h fast), relative abundance",,,,,metabolite quantification,,HMDP w/par,m,16wks,animal,,2014,,,,106,29,,,,,True,,,False,False,,BXH20/KccJ,m,45664868,0,1,1.85
50130,HMDPpheno6,css,,50130,homo_Ser,"liver homoserine (16h fast), relative abundance",,,,,metabolite quantification,,HMDP w/par,m,16wks,animal,,2014,,,,104,30,,,,,True,,,False,False,,BXH20/KccJ,m,73564,0,1,0.00
50131,HMDPpheno6,css,,50131,Ser,"liver serine (16h fast), relative abundance",,,,,metabolite quantification,,HMDP w/par,m,16wks,animal,,2014,,,,106,31,,,,,True,,,False,False,,BXH20/KccJ,m,37576704,0,1,1.36
50132,HMDPpheno6,css,,50132,Thr,"liver threonine (16h fast), relative abundance",,,,,metabolite quantification,,HMDP w/par,m,16wks,animal,,2014,,,,106,32,,,,,True,,,False,False,,BXH20/KccJ,m,10638275,0,1,1.06
50133,HMDPpheno6,css,,50133,betaine,"liver betaine (16h fast), relative abundance",,,,,metabolite quantification,,HMDP w/par,m,16wks,animal,,2014,,,,106,33,,,,,True,,,False,False,,BXH20/KccJ,m,6248243,0,1,-0.01
50134,HMDPpheno6,css,,50134,betaine_aldehyde,"liver betaine aldehyde (16h fast), relative abundance",,,,,metabolite quantification,,HMDP w/par,m,16wks,animal,,2014,,,,106,34,,,,,True,,,False,False,,BXH20/KccJ,m,2032663,0,1,1.31
50135,HMDPpheno6,css,,50135,MeC_Gly,"liver 3-methylcrotonylglycine (16h fast), relative abundance",,,,,metabolite quantification,,HMDP w/par,m,16wks,animal,,2014,,,,98,35,,,,,True,,,False,False,,BXH20/KccJ,m,43538,0,1,-0.01
50136,HMDPpheno6,css,,50136,guanidino,"liver 4-guanidinobutanoate (16h fast), relative abundance",,,,,metabolite quantification,,HMDP w/par,m,16wks,animal,,2014,,,,94,36,,,,,True,,,False,False,,BXH20/KccJ,m,56377,0,1,-0.07
50137,HMDPpheno6,css,,50137,MeLAA,"liver 1-methylimidazoleacetate (16h fast), relative abundance",,,,,metabolite quantification,,HMDP w/par,m,16wks,animal,,2014,,,,91,37,,,,,True,,,False,False,,BXH20/KccJ,m,68961,0,1,-0.01
50138,HMDPpheno6,css,,50138,His,"liver histidine (16h fast), relative abundance",,,,,metabolite quantification,,HMDP w/par,m,16wks,animal,,2014,,,,106,38,,,,,True,,,False,False,,BXH20/KccJ,m,320056,0,1,-0.17
50139,HMDPpheno6,css,,50139,glutarate,"liver glutarate (pentanedioate) (16h fast), relative abundance",,,,,metabolite quantification,,HMDP w/par,m,16wks,animal,,2014,,,,100,39,,,,,True,,,False,False,,BXH20/KccJ,m,13945,0,1,-0.25
50140,HMDPpheno6,css,,50140,acetyl_Lys,"liver N2-acetyllysine (16h fast), relative abundance",,,,,metabolite quantification,,HMDP w/par,m,16wks,animal,,2014,,,,105,40,,,,,True,,,False,False,,BXH20/KccJ,m,68938,0,1,-0.47
50141,HMDPpheno6,css,,50141,aminoadipate,"liver 2-aminoadipate (16h fast), relative abundance",,,,,metabolite quantification,,HMDP w/par,m,16wks,animal,,2014,,,,98,41,,,,,True,,,False,False,,BXH20/KccJ,m,169738,0,1,-0.25
50142,HMDPpheno6,css,,50142,GO_carnitine,"liver glutaroyl carnitine (16h fast), relative abundance",,,,,metabolite quantification,,HMDP w/par,m,16wks,animal,,2014,,,,106,42,,,,,True,,,False,False,,BXH20/KccJ,m,912832,0,1,0.06
50143,HMDPpheno6,css,,50143,Lys,"liver lysine (16h fast), relative abundance",,,,,metabolite quantification,,HMDP w/par,m,16wks,animal,,2014,,,,106,43,,,,,True,,,False,False,,BXH20/KccJ,m,2939262,0,1,0.22
50144,HMDPpheno6,css,,50144,pipecolate,"liver pipecolate (16h fast), relative abundance",,,,,metabolite quantification,,HMDP w/par,m,16wks,animal,,2014,,,,106,44,,,,,True,,,False,False,,BXH20/KccJ,m,224314,0,1,-0.97
50145,HMDPpheno6,css,,50145,Phe,"liver phenylalanine (16h fast), relative abundance",,,,,metabolite quantification,,HMDP w/par,m,16wks,animal,,2014,,,,106,45,,,,,True,,,False,False,,BXH20/KccJ,m,39028044,0,1,0.67
50146,HMDPpheno6,css,,50146,Tyr,"liver tyrosine (16h fast), relative abundance",,,,,metabolite quantification,,HMDP w/par,m,16wks,animal,,2014,,,,106,46,,,,,True,,,False,False,,BXH20/KccJ,m,10843531,0,1,0.45
50147,HMDPpheno6,css,,50147,HP_lactate,"liver 3-(4-hydroxyphenyl)lactate (16h fast), relative abundance",,,,,metabolite quantification,,HMDP w/par,m,16wks,animal,,2014,,,,106,47,,,,,True,,,False,False,,BXH20/KccJ,m,26283,0,1,0.05
50148,HMDPpheno6,css,,50148,PA_Gly,"liver phenylacetylglycine (16h fast), relative abundance",,,,,metabolite quantification,,HMDP w/par,m,16wks,animal,,2014,,,,105,48,,,,,True,,,False,False,,BXH20/KccJ,m,22650,0,1,0.07
50149,HMDPpheno6,css,,50149,phenol_sulfate,"liver phenol sulfate (16h fast), relative abundance",,,,,metabolite quantification,,HMDP w/par,m,16wks,animal,,2014,,,,103,49,,,,,True,,,False,False,,BXH20/KccJ,m,19171,0,1,-0.58
50150,HMDPpheno6,css,,50150,MTA,"liver 5-methylthioadenosine (MTA) (16h fast), relative abundance",,,,,metabolite quantification,,HMDP w/par,m,16wks,animal,,2014,,,,106,50,,,,,True,,,False,False,,BXH20/KccJ,m,46188,0,1,-0.39
50151,HMDPpheno6,css,,50151,spermidine,"liver spermidine (16h fast), relative abundance",,,,,metabolite quantification,,HMDP w/par,m,16wks,animal,,2014,,,,106,51,,,,,True,,,False,False,,BXH20/KccJ,m,316217,0,1,-0.07
50152,HMDPpheno6,css,,50152,anthranilate,"liver anthranilate (16h fast), relative abundance",,,,,metabolite quantification,,HMDP w/par,m,16wks,animal,,2014,,,,105,52,,,,,True,,,False,False,,BXH20/KccJ,m,58841,0,1,-0.43
50153,HMDPpheno6,css,,50153,glycosyl_Trp,"liver C-glycosyltryptophan (16h fast), relative abundance",,,,,metabolite quantification,,HMDP w/par,m,16wks,animal,,2014,,,,106,53,,,,,True,,,False,False,,BXH20/KccJ,m,160566,0,1,0.04
50154,HMDPpheno6,css,,50154,kynurenine,"liver kynurenine (16h fast), relative abundance",,,,,metabolite quantification,,HMDP w/par,m,16wks,animal,,2014,,,,106,54,,,,,True,,,False,False,,BXH20/KccJ,m,151581,0,1,-0.70
50155,HMDPpheno6,css,,50155,Trp,"liver tryptophan (16h fast), relative abundance",,,,,metabolite quantification,,HMDP w/par,m,16wks,animal,,2014,,,,106,55,,,,,True,,,False,False,,BXH20/KccJ,m,8166864,0,1,0.88
50156,HMDPpheno6,css,,50156,kynurenate,"liver kynurenate (16h fast), relative abundance",,,,,metabolite quantification,,HMDP w/par,m,16wks,animal,,2014,,,,105,56,,,,,True,,,False,False,,BXH20/KccJ,m,8154,0,1,-0.95
50157,HMDPpheno6,css,,50157,hydroxy_Pro,"liver trans-4-hydroxyproline (16h fast), relative abundance",,,,,metabolite quantification,,HMDP w/par,m,16wks,animal,,2014,,,,103,57,,,,,True,,,False,False,,BXH20/KccJ,m,155349,0,1,-0.24
50158,HMDPpheno6,css,,50158,ornithine,"liver ornithine (16h fast), relative abundance",,,,,metabolite quantification,,HMDP w/par,m,16wks,animal,,2014,,,,106,58,,,,,True,,,False,False,,BXH20/KccJ,m,5969337,0,1,0.45
50159,HMDPpheno6,css,,50159,urea,"liver urea (16h fast), relative abundance",,,,,metabolite quantification,,HMDP w/par,m,16wks,animal,,2014,,,,106,59,,,,,True,,,False,False,,BXH20/KccJ,m,2096603,0,1,0.16
50160,HMDPpheno6,css,,50160,acetylornithine,"liver N-acetylornithine (16h fast), relative abundance",,,,,metabolite quantification,,HMDP w/par,m,16wks,animal,,2014,,,,103,60,,,,,True,,,False,False,,BXH20/KccJ,m,101590,0,1,0.28
50161,HMDPpheno6,css,,50161,aminovalerate,"liver 5-aminovalerate (16h fast), relative abundance",,,,,metabolite quantification,,HMDP w/par,m,16wks,animal,,2014,,,,106,61,,,,,True,,,False,False,,BXH20/KccJ,m,578321,0,1,-0.32