measnum,projsym,mpdsector,seriestype,keymeasnum,varname,descrip,descrip2,units,datatype,magnitude,method,intervention,paneldesc,sextested,ageweeks,granularity,sourceparm,projyear,extname,reference,association,nstrainstested,listorder,label,supplemental,native_method,is_covar,is_measure,upload_factors,file_column,is_baseline,is_control,private,strain,sex,mean,sd,nmice,zscore
40301,Jentsch1,css,,40301,acq_initiated_trials,"number of initiated trials per daily session, acquisition phase",,n,,,operant conditioning chamber,,BXD w/par,m,17wks,animal,,2011,,,,53,1,,,,,True,,,False,False,,BXD22/TyJ,m,76.5,6.36,2,-0.67
40302,Jentsch1,css,,40302,acq_no_choice,"number of trials with no choice made in first 30 s, acquisition phase",,n,,,operant conditioning chamber,,BXD w/par,m,17wks,animal,,2011,,,,53,2,,,,,True,,,False,False,,BXD22/TyJ,m,11.0,1.41,2,-0.58
40303,Jentsch1,css,,40303,acq_anticipatory,"average number of anticipatory responses per trial, acquisition phase",,n,,,operant conditioning chamber,,BXD w/par,m,17wks,animal,,2011,,,,53,3,,,,,True,,,False,False,,BXD22/TyJ,m,1.75,0.354,2,-0.38
40304,Jentsch1,css,,40304,acq_latency_trial,"average latency to initiate trial, acquisition phase",,s,,,operant conditioning chamber,,BXD w/par,m,17wks,animal,,2011,,,,53,4,,,,,True,,,False,False,,BXD22/TyJ,m,34.3,3.39,2,-0.37
40305,Jentsch1,css,,40305,acq_latency_correct,"average latency to make correct choice, acquisition phase",,s,,,operant conditioning chamber,,BXD w/par,m,17wks,animal,,2011,,,,53,5,,,,,True,,,False,False,,BXD22/TyJ,m,7.70,2.55,2,0.11
40306,Jentsch1,css,,40306,acq_latency_reward,"average latency to retrieve food reward, acquisition phase",,s,,,operant conditioning chamber,,BXD w/par,m,17wks,animal,,2011,,,,53,6,,,,,True,,,False,False,,BXD22/TyJ,m,0.250,0.0707,2,-1.23
40307,Jentsch1,css,,40307,revers_init_trials,"number of initiated trials per daily session, reversal phase",,n,,,operant conditioning chamber,,BXD w/par,m,17wks,animal,,2011,,,,53,7,,,,,True,,,False,False,,BXD22/TyJ,m,236,9.19,2,1.12
40308,Jentsch1,css,,40308,revers_no_choice,"number of trials with no choice made in first 30 s, reversal phase",,n,,,operant conditioning chamber,,BXD w/par,m,17wks,animal,,2011,,,,53,8,,,,,True,,,False,False,,BXD22/TyJ,m,20.5,20.5,2,0.16
40309,Jentsch1,css,,40309,revers_anticipatory,"average number of anticipatory responses per trial, reversal phase",,n,,,operant conditioning chamber,,BXD w/par,m,17wks,animal,,2011,,,,53,9,,,,,True,,,False,False,,BXD22/TyJ,m,5.60,0.849,2,1.78
40310,Jentsch1,css,,40310,revers_latency_trial,"average latency to initiate trial, reversal phase",,s,,,operant conditioning chamber,,BXD w/par,m,17wks,animal,,2011,,,,53,10,,,,,True,,,False,False,,BXD22/TyJ,m,30.9,6.51,2,-0.56
40311,Jentsch1,css,,40311,revers_latency_correct,"average latency to make correct choice, reversal phase",,s,,,operant conditioning chamber,,BXD w/par,m,17wks,animal,,2011,,,,53,11,,,,,True,,,False,False,,BXD22/TyJ,m,5.95,3.46,2,0.45
40312,Jentsch1,css,,40312,revers_latency_reward,"average latency to retrieve food reward, reversal phase",,s,,,operant conditioning chamber,,BXD w/par,m,17wks,animal,,2011,,,,53,12,,,,,True,,,False,False,,BXD22/TyJ,m,0.250,0.0707,2,-0.84
44301,Donahue17,css,,44301,litter_interval,mean litter interval,,wks,,,colony observation,,BXD,f,3-57wks,animal,,2011,,,,30,1,,,,,True,,,False,False,,BXD22/TyJ,f,4.58,0.945,8,-0.39
44302,Donahue17,css,,44302,litter_size_birth,mean number of pups born,,n,,,colony observation,,BXD,f,3-57wks,animal,,2011,,,,30,2,,,,,True,,,False,False,,BXD22/TyJ,f,2.99,0.647,8,-2.09
44303,Donahue17,css,,44303,litter_size_wean,mean number of pups weaned,,n,,,colony observation,,BXD,f,3-57wks,animal,,2011,,,,30,3,,,,,True,,,False,False,,BXD22/TyJ,f,2.00,0.804,8,-2.12
44304,Donahue17,css,,44304,ratio_wean_born,ratio of pups weaned to pups born,,ratio,,,colony observation,,BXD,f,3-57wks,animal,,2011,,,,30,4,,,,,True,,,False,False,,BXD22/TyJ,f,0.700,0.288,8,-1.63
44305,Donahue17,css,,44305,fecundity_index,mean litter size divided by mean litter interval,,n/wks,,,colony observation,,BXD,f,3-57wks,animal,,2011,,,,30,5,,,,,True,,,False,False,,BXD22/TyJ,f,0.675,0.255,8,-1.58
44306,Donahue17,css,,44306,pct_Fwean,percent females at weaning,,%,,,colony observation,,BXD,f,3-57wks,animal,,2011,,,,30,6,,,,,True,,,False,False,,BXD22/TyJ,f,41.9,23.0,8,-1.80
46401,HMDPpheno2,css,,46401,HDL,HDL cholesterol (plasma HDL),,mg/dL,,,lipid profile,,HMDP w/par,m,16wks,animal,,2010,,,,99,1,,,,,True,,,False,False,,BXD22/TyJ,m,103,0,1,0.37
46402,HMDPpheno2,css,,46402,LDL_VLDL,low density lipoprotein (plasma LDL) plus very low density lipoprotein (plasma VLDL),,mg/dL,,,lipid profile,,HMDP w/par,m,16wks,animal,,2010,,,,99,2,,,,,True,,,False,False,,BXD22/TyJ,m,15.0,0,1,-0.57
46403,HMDPpheno2,css,,46403,CHOL_un,unesterified cholesterol (plasma CHOL),,mg/dL,,,lipid profile,,HMDP w/par,m,16wks,animal,,2010,,,,99,3,,,,,True,,,False,False,,BXD22/TyJ,m,26.0,0,1,0.36
46404,HMDPpheno2,css,,46404,CHOL_tot,total cholesterol (plasma CHOL),,mg/dL,,,lipid profile,,HMDP w/par,m,16wks,animal,,2010,,,,99,4,,,,,True,,,False,False,,BXD22/TyJ,m,118,0,1,0.06
46405,HMDPpheno2,css,,46405,FFA,free fatty acids (plasma FFA),,mEq/L,,,lipid profile,,HMDP w/par,m,16wks,animal,,2010,,,,99,5,,,,,True,,,False,False,,BXD22/TyJ,m,47.0,0,1,-0.21
46406,HMDPpheno2,css,,46406,TG,"triglycerides (plasma TG, 16h fast)",,mg/dL,,,lipid profile,,HMDP w/par,m,16wks,animal,,2010,,,,99,6,,,,,True,,,False,False,,BXD22/TyJ,m,22.0,0,1,-1.00
46407,HMDPpheno2,css,,46407,pct_fat,"percentage of tissue mass that is fat, whole body with head (NMR)",,%,,,NMR,,HMDP w/par,m,16wks,animal,,2010,,,,99,7,,,,,True,,,False,False,,BXD22/TyJ,m,11.8,3.27,2,-0.46
47801,Rosen1,css,,47801,corpus_callosum,corpus callosum area,,mm<sup>2</sup>,,,histopathology,,BXD w/par,both,varies,animal,,2012,,,,78,1,,,,,True,,,False,False,,BXD22/TyJ,f,1.01,0.360,3,-0.42
47801,Rosen1,css,,47801,corpus_callosum,corpus callosum area,,mm<sup>2</sup>,,,histopathology,,BXD w/par,both,varies,animal,,2012,,,,78,1,,,,,True,,,False,False,,BXD22/TyJ,m,0.677,0.202,2,-1.90
47802,Rosen1,css,,47802,corpus_callosum_adj,"corpus callosum area, adjusted",,mm<sup>2</sup>,,,histopathology,,BXD w/par,both,varies,animal,,2012,,,,78,2,,,,,True,,,False,False,,BXD22/TyJ,m,0.770,0.131,2,-1.78
47802,Rosen1,css,,47802,corpus_callosum_adj,"corpus callosum area, adjusted",,mm<sup>2</sup>,,,histopathology,,BXD w/par,both,varies,animal,,2012,,,,78,2,,,,,True,,,False,False,,BXD22/TyJ,f,0.953,0.246,3,-0.89
47803,Rosen1,css,,47803,age,age (local parameter),,d,,,colony observation,,BXD w/par,both,varies,animal,,2012,,,,78,3,,,,,True,,,False,False,,BXD22/TyJ,m,49.0,15.6,2,-1.03
47803,Rosen1,css,,47803,age,age (local parameter),,d,,,colony observation,,BXD w/par,both,varies,animal,,2012,,,,78,3,,,,,True,,,False,False,,BXD22/TyJ,f,174,65.5,3,1.23
47901,Rosen2,css,,47901,lateral_septum,lateral septum volume,,mm<sup>3</sup>,,,histopathology,,BXD w/par,both,varies,animal,,2012,,,,71,1,,,,,True,,,False,False,,BXD22/TyJ,m,3.78,0,1,1.64
47901,Rosen2,css,,47901,lateral_septum,lateral septum volume,,mm<sup>3</sup>,,,histopathology,,BXD w/par,both,varies,animal,,2012,,,,71,1,,,,,True,,,False,False,,BXD22/TyJ,f,4.32,0.587,2,2.91
47902,Rosen2,css,,47902,lateral_septum_adj,"lateral septum volume, adjusted",,mm<sup>3</sup>,,,histopathology,,BXD w/par,both,varies,animal,,2012,,,,71,2,,,,,True,,,False,False,,BXD22/TyJ,m,3.69,0,1,1.51
47902,Rosen2,css,,47902,lateral_septum_adj,"lateral septum volume, adjusted",,mm<sup>3</sup>,,,histopathology,,BXD w/par,both,varies,animal,,2012,,,,71,2,,,,,True,,,False,False,,BXD22/TyJ,f,4.14,0.396,2,2.92
47903,Rosen2,css,,47903,age,age (local parameter),,d,,,colony observation,,BXD w/par,both,varies,animal,,2012,,,,71,3,,,,,True,,,False,False,,BXD22/TyJ,m,60.0,0,1,-0.90
47903,Rosen2,css,,47903,age,age (local parameter),,d,,,colony observation,,BXD w/par,both,varies,animal,,2012,,,,71,3,,,,,True,,,False,False,,BXD22/TyJ,f,179,7.07,2,0.87
48101,Schalkwyk2,css,,48101,miR15b,"miR-15b, hippocampal microRNA expression, relative",,,,,RNA expression profiling,,BXD w/par,m,15-16wks,strainsex,,2012,,,,26,1,,,,,True,,,False,False,,BXD22/TyJ,m,0.0550,0.0200,4,0.63
48102,Schalkwyk2,css,,48102,miR31,"miR-31, hippocampal microRNA expression, relative",,,,,RNA expression profiling,,BXD w/par,m,15-16wks,strainsex,,2012,,,,26,2,,,,,True,,,False,False,,BXD22/TyJ,m,0.0940,0.0300,4,0.77
48103,Schalkwyk2,css,,48103,miR34c,"miR-34c, hippocampal microRNA expression, relative",,,,,RNA expression profiling,,BXD w/par,m,15-16wks,strainsex,,2012,,,,26,3,,,,,True,,,False,False,,BXD22/TyJ,m,0.0550,0.0100,4,0.06
48104,Schalkwyk2,css,,48104,miR212,"miR-212, hippocampal microRNA expression, relative",,,,,RNA expression profiling,,BXD w/par,m,15-16wks,strainsex,,2012,,,,26,4,,,,,True,,,False,False,,BXD22/TyJ,m,0.0970,0.0200,4,-1.39
48105,Schalkwyk2,css,,48105,miR301a,"miR-301a, hippocampal microRNA expression, relative",,,,,RNA expression profiling,,BXD w/par,m,15-16wks,strainsex,,2012,,,,26,5,,,,,True,,,False,False,,BXD22/TyJ,m,0.186,0.0200,4,0.51
48901,HMDPpheno5,css,,48901,WBC,white blood cell count (WBC; units per volume x 10<sup>3</sup>),,n/&micro;L,,3,complete blood count,,HMDP w/par,m,16wks,animal,,2013,,,,79,1,,,,,True,,,False,False,,BXD22/TyJ,m,4.60,2.12,2,0.58
48907,HMDPpheno5,css,,48907,LYM,lymphocyte count (LYM; units per volume x 10<sup>3</sup>),,n/&micro;L,,3,complete blood count,,HMDP w/par,m,16wks,animal,,2013,,,,79,7,,,,,True,,,False,False,,BXD22/TyJ,m,3.50,1.70,2,0.79
48913,HMDPpheno5,css,,48913,pct_LYM,lymphocyte differential (LYM; percentage of viable WBC),,%,,,complete blood count,,HMDP w/par,m,16wks,animal,,2013,,,,79,13,,,,,True,,,False,False,,BXD22/TyJ,m,75.0,2.26,2,1.19
48919,HMDPpheno5,css,,48919,MONO,monocyte count (MONO; units per volume x 10<sup>3</sup>),,n/&micro;L,,3,complete blood count,,HMDP w/par,m,16wks,animal,,2013,,,,79,19,,,,,True,,,False,False,,BXD22/TyJ,m,0.250,0.0707,2,-0.31
48925,HMDPpheno5,css,,48925,pct_MONO,monocyte differential (MONO; percentage of viable WBC),,%,,,complete blood count,,HMDP w/par,m,16wks,animal,,2013,,,,79,25,,,,,True,,,False,False,,BXD22/TyJ,m,5.60,1.56,2,-0.88
48931,HMDPpheno5,css,,48931,GRA,granulocyte count (GRA; units per volume x 10<sup>3</sup>),,n/&micro;L,,3,complete blood count,,HMDP w/par,m,16wks,animal,,2013,,,,79,31,,,,,True,,,False,False,,BXD22/TyJ,m,0.850,0.354,2,0.17
48937,HMDPpheno5,css,,48937,pct_GRA,granulocyte differential (GRA; percentage of total viable WBC),,%,,,complete blood count,,HMDP w/par,m,16wks,animal,,2013,,,,79,37,,,,,True,,,False,False,,BXD22/TyJ,m,19.4,0.707,2,-1.11
48943,HMDPpheno5,css,,48943,RBC,red blood cell count (RBC; units per volume x 10<sup>6</sup>),,n/&micro;L,,6,complete blood count,,HMDP w/par,m,16wks,animal,,2013,,,,83,43,,,,,True,,,False,False,,BXD22/TyJ,m,8.32,3.99,2,-0.07
48949,HMDPpheno5,css,,48949,MCV,mean RBC corpuscular volume (MCV),,fL,,,complete blood count,,HMDP w/par,m,16wks,animal,,2013,,,,83,49,,,,,True,,,False,False,,BXD22/TyJ,m,38.3,1.98,2,-1.59
48955,HMDPpheno5,css,,48955,RDW,RBC corpuscular distribution width (RDW),,%,,,complete blood count,,HMDP w/par,m,16wks,animal,,2013,,,,83,55,,,,,True,,,False,False,,BXD22/TyJ,m,19.9,0.495,2,2.30
48961,HMDPpheno5,css,,48961,MCH,mean RBC corpuscular hemoglobin (MCH),,pg,,,complete blood count,,HMDP w/par,m,16wks,animal,,2013,,,,83,61,,,,,True,,,False,False,,BXD22/TyJ,m,16.4,3.18,2,1.54
48967,HMDPpheno5,css,,48967,MCHC,mean RBC corpuscular hemoglobin concentration (MCHC),,g/dL,,,complete blood count,,HMDP w/par,m,16wks,animal,,2013,,,,83,67,,,,,True,,,False,False,,BXD22/TyJ,m,43.0,10.3,2,2.83
48973,HMDPpheno5,css,,48973,HGB,hemoglobin (HGB),,g/dL,,,complete blood count,,HMDP w/par,m,16wks,animal,,2013,,,,83,73,,,,,True,,,False,False,,BXD22/TyJ,m,13.0,3.96,2,0.19
48979,HMDPpheno5,css,,48979,HCT,hematocrit (HCT),,%,,,complete blood count,,HMDP w/par,m,16wks,animal,,2013,,,,83,79,,,,,True,,,False,False,,BXD22/TyJ,m,32.3,17.0,2,-0.70
48985,HMDPpheno5,css,,48985,PLT,platelet count (PLT; units per volume x 10<sup>3</sup>),,n/&micro;L,,3,complete blood count,,HMDP w/par,m,16wks,animal,,2013,,,,83,85,,,,,True,,,False,False,,BXD22/TyJ,m,176,117,2,-1.07
48991,HMDPpheno5,css,,48991,MPV,mean platelet volume (MPV),,fL,,,complete blood count,,HMDP w/par,m,16wks,animal,,2013,,,,83,91,,,,,True,,,False,False,,BXD22/TyJ,m,5.95,0.0707,2,-0.66
50101,HMDPpheno6,css,,50101,Ala,"liver alanine (16h fast), relative abundance",,,,,metabolite quantification,,HMDP w/par,m,16wks,animal,,2014,,,,106,1,,,,,True,,,False,False,,BXD22/TyJ,m,64293276,0,1,-0.54
50102,HMDPpheno6,css,,50102,Asn,"liver asparagine (16h fast), relative abundance",,,,,metabolite quantification,,HMDP w/par,m,16wks,animal,,2014,,,,106,2,,,,,True,,,False,False,,BXD22/TyJ,m,358272,0,1,0.55
50103,HMDPpheno6,css,,50103,Asp,"liver aspartate (16h fast), relative abundance",,,,,metabolite quantification,,HMDP w/par,m,16wks,animal,,2014,,,,106,3,,,,,True,,,False,False,,BXD22/TyJ,m,13656952,0,1,0.36
50104,HMDPpheno6,css,,50104,beta_Ala,"liver beta-alanine (16h fast), relative abundance",,,,,metabolite quantification,,HMDP w/par,m,16wks,animal,,2014,,,,106,4,,,,,True,,,False,False,,BXD22/TyJ,m,535765,0,1,-0.79
50105,HMDPpheno6,css,,50105,acetyl_Asn,"liver N-acetylasparagine (16h fast), relative abundance",,,,,metabolite quantification,,HMDP w/par,m,16wks,animal,,2014,,,,103,5,,,,,True,,,False,False,,BXD22/TyJ,m,73359,0,1,0.21
50106,HMDPpheno6,css,,50106,acetyl_Ala,"liver N-acetylalanine (16h fast), relative abundance",,,,,metabolite quantification,,HMDP w/par,m,16wks,animal,,2014,,,,104,6,,,,,True,,,False,False,,BXD22/TyJ,m,19778,0,1,-0.40
50107,HMDPpheno6,css,,50107,aminobutyrate,"liver 2-aminobutyrate (16h fast), relative abundance",,,,,metabolite quantification,,HMDP w/par,m,16wks,animal,,2014,,,,106,7,,,,,True,,,False,False,,BXD22/TyJ,m,1318291,0,1,-0.33
50108,HMDPpheno6,css,,50108,creatine,"liver creatine (16h fast), relative abundance",,,,,metabolite quantification,,HMDP w/par,m,16wks,animal,,2014,,,,106,8,,,,,True,,,False,False,,BXD22/TyJ,m,4534339,0,1,0.94
50109,HMDPpheno6,css,,50109,AHB,"liver 2-hydroxybutyrate (AHB) (16h fast), relative abundance",,,,,metabolite quantification,,HMDP w/par,m,16wks,animal,,2014,,,,99,9,,,,,True,,,False,False,,BXD22/TyJ,m,86073,0,1,-0.86
50110,HMDPpheno6,css,,50110,Cys,"liver cysteine (16h fast), relative abundance",,,,,metabolite quantification,,HMDP w/par,m,16wks,animal,,2014,,,,106,10,,,,,True,,,False,False,,BXD22/TyJ,m,1423934,0,1,0.28
50111,HMDPpheno6,css,,50111,hypotaurine,"liver hypotaurine (16h fast), relative abundance",,,,,metabolite quantification,,HMDP w/par,m,16wks,animal,,2014,,,,106,11,,,,,True,,,False,False,,BXD22/TyJ,m,1565917,0,1,0.08
50112,HMDPpheno6,css,,50112,Met,"liver methionine (16h fast), relative abundance",,,,,metabolite quantification,,HMDP w/par,m,16wks,animal,,2014,,,,106,12,,,,,True,,,False,False,,BXD22/TyJ,m,8406483,0,1,0.98
50113,HMDPpheno6,css,,50113,Met_sulf,"liver methionine sulfoxide (16h fast), relative abundance",,,,,metabolite quantification,,HMDP w/par,m,16wks,animal,,2014,,,,104,13,,,,,True,,,False,False,,BXD22/TyJ,m,166662,0,1,-0.23
50114,HMDPpheno6,css,,50114,taurine,"liver taurine (16h fast), relative abundance",,,,,metabolite quantification,,HMDP w/par,m,16wks,animal,,2014,,,,106,14,,,,,True,,,False,False,,BXD22/TyJ,m,1186793,0,1,-0.28
50115,HMDPpheno6,css,,50115,acetyl_Met,"liver N-acetylmethionine (16h fast), relative abundance",,,,,metabolite quantification,,HMDP w/par,m,16wks,animal,,2014,,,,106,15,,,,,True,,,False,False,,BXD22/TyJ,m,25209,0,1,0.33
50116,HMDPpheno6,css,,50116,SAH,"liver S-adenosylhomocysteine (SAH) (16h fast), relative abundance",,,,,metabolite quantification,,HMDP w/par,m,16wks,animal,,2014,,,,106,16,,,,,True,,,False,False,,BXD22/TyJ,m,35379,0,1,-0.53
50117,HMDPpheno6,css,,50117,GABA,"liver gamma-aminobutyrate (GABA) (16h fast), relative abundance",,,,,metabolite quantification,,HMDP w/par,m,16wks,animal,,2014,,,,106,17,,,,,True,,,False,False,,BXD22/TyJ,m,364903,0,1,-0.30
50118,HMDPpheno6,css,,50118,acetyl_Glu,"liver N-acetylglutamate (16h fast), relative abundance",,,,,metabolite quantification,,HMDP w/par,m,16wks,animal,,2014,,,,106,18,,,,,True,,,False,False,,BXD22/TyJ,m,112012,0,1,-0.39
50119,HMDPpheno6,css,,50119,Gln,"liver glutamine (16h fast), relative abundance",,,,,metabolite quantification,,HMDP w/par,m,16wks,animal,,2014,,,,106,19,,,,,True,,,False,False,,BXD22/TyJ,m,9717335,0,1,-1.13
50120,HMDPpheno6,css,,50120,Glu,"liver glutamate (16h fast), relative abundance",,,,,metabolite quantification,,HMDP w/par,m,16wks,animal,,2014,,,,106,20,,,,,True,,,False,False,,BXD22/TyJ,m,9442537,0,1,2.64
50121,HMDPpheno6,css,,50121,CySSG,"liver cysteine-glutathione disulfide (16h fast), relative abundance",,,,,metabolite quantification,,HMDP w/par,m,16wks,animal,,2014,,,,106,21,,,,,True,,,False,False,,BXD22/TyJ,m,1585669,0,1,-1.00
50122,HMDPpheno6,css,,50122,GSH,"liver glutathione, reduced (GSH) (16h fast), relative abundance",,,,,metabolite quantification,,HMDP w/par,m,16wks,animal,,2014,,,,104,22,,,,,True,,,False,False,,BXD22/TyJ,m,308891,0,1,0.32
50123,HMDPpheno6,css,,50123,GSSG,"liver glutathione, oxidized (GSSG) (16h fast), relative abundance",,,,,metabolite quantification,,HMDP w/par,m,16wks,animal,,2014,,,,106,23,,,,,True,,,False,False,,BXD22/TyJ,m,12111386,0,1,0.00
50124,HMDPpheno6,css,,50124,Me_glutathione,"liver S-methylglutathione (16h fast), relative abundance",,,,,metabolite quantification,,HMDP w/par,m,16wks,animal,,2014,,,,106,24,,,,,True,,,False,False,,BXD22/TyJ,m,95217,0,1,-0.97
50125,HMDPpheno6,css,,50125,ophthalmate,"liver ophthalmate (16h fast), relative abundance",,,,,metabolite quantification,,HMDP w/par,m,16wks,animal,,2014,,,,106,25,,,,,True,,,False,False,,BXD22/TyJ,m,391480,0,1,-0.65
50126,HMDPpheno6,css,,50126,oxoproline,"liver 5-oxoproline (16h fast), relative abundance",,,,,metabolite quantification,,HMDP w/par,m,16wks,animal,,2014,,,,106,26,,,,,True,,,False,False,,BXD22/TyJ,m,171513,0,1,-0.44
50127,HMDPpheno6,css,,50127,acetyl_Gly,"liver N-acetylglycine (16h fast), relative abundance",,,,,metabolite quantification,,HMDP w/par,m,16wks,animal,,2014,,,,96,27,,,,,True,,,False,False,,BXD22/TyJ,m,63205,0,1,0.00
50128,HMDPpheno6,css,,50128,diMe_Gly,"liver dimethylglycine (16h fast), relative abundance",,,,,metabolite quantification,,HMDP w/par,m,16wks,animal,,2014,,,,96,28,,,,,True,,,False,False,,BXD22/TyJ,m,221952,0,1,-0.29
50129,HMDPpheno6,css,,50129,Gly,"liver glycine (16h fast), relative abundance",,,,,metabolite quantification,,HMDP w/par,m,16wks,animal,,2014,,,,106,29,,,,,True,,,False,False,,BXD22/TyJ,m,40014000,0,1,0.94
50130,HMDPpheno6,css,,50130,homo_Ser,"liver homoserine (16h fast), relative abundance",,,,,metabolite quantification,,HMDP w/par,m,16wks,animal,,2014,,,,104,30,,,,,True,,,False,False,,BXD22/TyJ,m,44103,0,1,-0.51
50131,HMDPpheno6,css,,50131,Ser,"liver serine (16h fast), relative abundance",,,,,metabolite quantification,,HMDP w/par,m,16wks,animal,,2014,,,,106,31,,,,,True,,,False,False,,BXD22/TyJ,m,33540570,0,1,0.76
50132,HMDPpheno6,css,,50132,Thr,"liver threonine (16h fast), relative abundance",,,,,metabolite quantification,,HMDP w/par,m,16wks,animal,,2014,,,,106,32,,,,,True,,,False,False,,BXD22/TyJ,m,9894839,0,1,0.70
50133,HMDPpheno6,css,,50133,betaine,"liver betaine (16h fast), relative abundance",,,,,metabolite quantification,,HMDP w/par,m,16wks,animal,,2014,,,,106,33,,,,,True,,,False,False,,BXD22/TyJ,m,7937110,0,1,0.79
50134,HMDPpheno6,css,,50134,betaine_aldehyde,"liver betaine aldehyde (16h fast), relative abundance",,,,,metabolite quantification,,HMDP w/par,m,16wks,animal,,2014,,,,106,34,,,,,True,,,False,False,,BXD22/TyJ,m,2011465,0,1,1.25
50135,HMDPpheno6,css,,50135,MeC_Gly,"liver 3-methylcrotonylglycine (16h fast), relative abundance",,,,,metabolite quantification,,HMDP w/par,m,16wks,animal,,2014,,,,98,35,,,,,True,,,False,False,,BXD22/TyJ,m,46326,0,1,0.13
50136,HMDPpheno6,css,,50136,guanidino,"liver 4-guanidinobutanoate (16h fast), relative abundance",,,,,metabolite quantification,,HMDP w/par,m,16wks,animal,,2014,,,,94,36,,,,,True,,,False,False,,BXD22/TyJ,m,37452,0,1,-0.30
50137,HMDPpheno6,css,,50137,MeLAA,"liver 1-methylimidazoleacetate (16h fast), relative abundance",,,,,metabolite quantification,,HMDP w/par,m,16wks,animal,,2014,,,,91,37,,,,,True,,,False,False,,BXD22/TyJ,m,46125,0,1,-0.41
50138,HMDPpheno6,css,,50138,His,"liver histidine (16h fast), relative abundance",,,,,metabolite quantification,,HMDP w/par,m,16wks,animal,,2014,,,,106,38,,,,,True,,,False,False,,BXD22/TyJ,m,282732,0,1,-0.68
50139,HMDPpheno6,css,,50139,glutarate,"liver glutarate (pentanedioate) (16h fast), relative abundance",,,,,metabolite quantification,,HMDP w/par,m,16wks,animal,,2014,,,,100,39,,,,,True,,,False,False,,BXD22/TyJ,m,29504,0,1,-0.18
50140,HMDPpheno6,css,,50140,acetyl_Lys,"liver N2-acetyllysine (16h fast), relative abundance",,,,,metabolite quantification,,HMDP w/par,m,16wks,animal,,2014,,,,105,40,,,,,True,,,False,False,,BXD22/TyJ,m,77520,0,1,-0.26
50141,HMDPpheno6,css,,50141,aminoadipate,"liver 2-aminoadipate (16h fast), relative abundance",,,,,metabolite quantification,,HMDP w/par,m,16wks,animal,,2014,,,,98,41,,,,,True,,,False,False,,BXD22/TyJ,m,252131,0,1,-0.23
50142,HMDPpheno6,css,,50142,GO_carnitine,"liver glutaroyl carnitine (16h fast), relative abundance",,,,,metabolite quantification,,HMDP w/par,m,16wks,animal,,2014,,,,106,42,,,,,True,,,False,False,,BXD22/TyJ,m,339764,0,1,-0.18
50143,HMDPpheno6,css,,50143,Lys,"liver lysine (16h fast), relative abundance",,,,,metabolite quantification,,HMDP w/par,m,16wks,animal,,2014,,,,106,43,,,,,True,,,False,False,,BXD22/TyJ,m,3207296,0,1,0.79
50144,HMDPpheno6,css,,50144,pipecolate,"liver pipecolate (16h fast), relative abundance",,,,,metabolite quantification,,HMDP w/par,m,16wks,animal,,2014,,,,106,44,,,,,True,,,False,False,,BXD22/TyJ,m,331313,0,1,-0.45
50145,HMDPpheno6,css,,50145,Phe,"liver phenylalanine (16h fast), relative abundance",,,,,metabolite quantification,,HMDP w/par,m,16wks,animal,,2014,,,,106,45,,,,,True,,,False,False,,BXD22/TyJ,m,41746932,0,1,1.09
50146,HMDPpheno6,css,,50146,Tyr,"liver tyrosine (16h fast), relative abundance",,,,,metabolite quantification,,HMDP w/par,m,16wks,animal,,2014,,,,106,46,,,,,True,,,False,False,,BXD22/TyJ,m,13531435,0,1,1.46
50147,HMDPpheno6,css,,50147,HP_lactate,"liver 3-(4-hydroxyphenyl)lactate (16h fast), relative abundance",,,,,metabolite quantification,,HMDP w/par,m,16wks,animal,,2014,,,,106,47,,,,,True,,,False,False,,BXD22/TyJ,m,25457,0,1,-0.06
50148,HMDPpheno6,css,,50148,PA_Gly,"liver phenylacetylglycine (16h fast), relative abundance",,,,,metabolite quantification,,HMDP w/par,m,16wks,animal,,2014,,,,105,48,,,,,True,,,False,False,,BXD22/TyJ,m,19167,0,1,-0.22
50149,HMDPpheno6,css,,50149,phenol_sulfate,"liver phenol sulfate (16h fast), relative abundance",,,,,metabolite quantification,,HMDP w/par,m,16wks,animal,,2014,,,,103,49,,,,,True,,,False,False,,BXD22/TyJ,m,22449,0,1,-0.43
50150,HMDPpheno6,css,,50150,MTA,"liver 5-methylthioadenosine (MTA) (16h fast), relative abundance",,,,,metabolite quantification,,HMDP w/par,m,16wks,animal,,2014,,,,106,50,,,,,True,,,False,False,,BXD22/TyJ,m,43656,0,1,-0.48
50151,HMDPpheno6,css,,50151,spermidine,"liver spermidine (16h fast), relative abundance",,,,,metabolite quantification,,HMDP w/par,m,16wks,animal,,2014,,,,106,51,,,,,True,,,False,False,,BXD22/TyJ,m,306910,0,1,-0.13
50152,HMDPpheno6,css,,50152,anthranilate,"liver anthranilate (16h fast), relative abundance",,,,,metabolite quantification,,HMDP w/par,m,16wks,animal,,2014,,,,105,52,,,,,True,,,False,False,,BXD22/TyJ,m,43416,0,1,-0.80
50153,HMDPpheno6,css,,50153,glycosyl_Trp,"liver C-glycosyltryptophan (16h fast), relative abundance",,,,,metabolite quantification,,HMDP w/par,m,16wks,animal,,2014,,,,106,53,,,,,True,,,False,False,,BXD22/TyJ,m,223938,0,1,1.85