measnum,projsym,mpdsector,seriestype,keymeasnum,varname,descrip,descrip2,units,datatype,magnitude,method,intervention,paneldesc,sextested,ageweeks,granularity,sourceparm,projyear,extname,reference,association,nstrainstested,listorder,label,supplemental,native_method,is_covar,is_measure,upload_factors,file_column,is_baseline,is_control,private,strain,sex,mean,sd,nmice,zscore
42202,Donahue13,css,,42202,litter_interval,mean litter interval,,wks,,,colony observation,,CXB,f,3-50wks,animal,,2011,,,,13,2,,,,,True,,,False,False,,CXB2/ByJ,f,4.79,0.544,8,-0.44
42203,Donahue13,css,,42203,litter_size_birth,mean number of pups born,,n,,,colony observation,,CXB,f,3-50wks,animal,,2011,,,,13,3,,,,,True,,,False,False,,CXB2/ByJ,f,5.36,0.670,8,-1.00
42204,Donahue13,css,,42204,litter_size_wean,mean number of pups weaned,,n,,,colony observation,,CXB,f,3-50wks,animal,,2011,,,,13,4,,,,,True,,,False,False,,CXB2/ByJ,f,4.88,0.680,8,-1.07
42205,Donahue13,css,,42205,ratio_wean_born,ratio of pups weaned to pups born,,ratio,,,colony observation,,CXB,f,3-50wks,animal,,2011,,,,13,5,,,,,True,,,False,False,,CXB2/ByJ,f,0.875,0.128,8,-0.88
42206,Donahue13,css,,42206,fecundity_index,mean litter size divided by mean litter interval,,n/wks,,,colony observation,,CXB,f,3-50wks,animal,,2011,,,,13,6,,,,,True,,,False,False,,CXB2/ByJ,f,1.13,0.144,8,-0.54
42207,Donahue13,css,,42207,pct_Fwean,percent females at weaning,,%,,,colony observation,,CXB,f,3-50wks,animal,,2011,,,,13,7,,,,,True,,,False,False,,CXB2/ByJ,f,51.2,6.58,8,0.64
48901,HMDPpheno5,css,,48901,WBC,white blood cell count (WBC; units per volume x 10<sup>3</sup>),,n/&micro;L,,3,complete blood count,,HMDP w/par,m,16wks,animal,,2013,,,,79,1,,,,,True,,,False,False,,CXB2/ByJ,m,3.70,1.06,6,0.09
48907,HMDPpheno5,css,,48907,LYM,lymphocyte count (LYM; units per volume x 10<sup>3</sup>),,n/&micro;L,,3,complete blood count,,HMDP w/par,m,16wks,animal,,2013,,,,79,7,,,,,True,,,False,False,,CXB2/ByJ,m,2.55,0.704,6,0.08
48913,HMDPpheno5,css,,48913,pct_LYM,lymphocyte differential (LYM; percentage of viable WBC),,%,,,complete blood count,,HMDP w/par,m,16wks,animal,,2013,,,,79,13,,,,,True,,,False,False,,CXB2/ByJ,m,70.1,7.50,6,0.23
48919,HMDPpheno5,css,,48919,MONO,monocyte count (MONO; units per volume x 10<sup>3</sup>),,n/&micro;L,,3,complete blood count,,HMDP w/par,m,16wks,animal,,2013,,,,79,19,,,,,True,,,False,False,,CXB2/ByJ,m,0.333,0.137,6,0.19
48925,HMDPpheno5,css,,48925,pct_MONO,monocyte differential (MONO; percentage of viable WBC),,%,,,complete blood count,,HMDP w/par,m,16wks,animal,,2013,,,,79,25,,,,,True,,,False,False,,CXB2/ByJ,m,7.38,2.39,6,0.29
48931,HMDPpheno5,css,,48931,GRA,granulocyte count (GRA; units per volume x 10<sup>3</sup>),,n/&micro;L,,3,complete blood count,,HMDP w/par,m,16wks,animal,,2013,,,,79,31,,,,,True,,,False,False,,CXB2/ByJ,m,0.817,0.343,6,0.08
48937,HMDPpheno5,css,,48937,pct_GRA,granulocyte differential (GRA; percentage of total viable WBC),,%,,,complete blood count,,HMDP w/par,m,16wks,animal,,2013,,,,79,37,,,,,True,,,False,False,,CXB2/ByJ,m,22.6,5.45,6,-0.37
48943,HMDPpheno5,css,,48943,RBC,red blood cell count (RBC; units per volume x 10<sup>6</sup>),,n/&micro;L,,6,complete blood count,,HMDP w/par,m,16wks,animal,,2013,,,,83,43,,,,,True,,,False,False,,CXB2/ByJ,m,10.3,1.17,6,1.21
48949,HMDPpheno5,css,,48949,MCV,mean RBC corpuscular volume (MCV),,fL,,,complete blood count,,HMDP w/par,m,16wks,animal,,2013,,,,83,49,,,,,True,,,False,False,,CXB2/ByJ,m,41.9,1.32,6,-0.66
48955,HMDPpheno5,css,,48955,RDW,RBC corpuscular distribution width (RDW),,%,,,complete blood count,,HMDP w/par,m,16wks,animal,,2013,,,,83,55,,,,,True,,,False,False,,CXB2/ByJ,m,17.3,0.250,6,0.23
48961,HMDPpheno5,css,,48961,MCH,mean RBC corpuscular hemoglobin (MCH),,pg,,,complete blood count,,HMDP w/par,m,16wks,animal,,2013,,,,83,61,,,,,True,,,False,False,,CXB2/ByJ,m,15.1,0.532,6,-0.01
48967,HMDPpheno5,css,,48967,MCHC,mean RBC corpuscular hemoglobin concentration (MCHC),,g/dL,,,complete blood count,,HMDP w/par,m,16wks,animal,,2013,,,,83,67,,,,,True,,,False,False,,CXB2/ByJ,m,36.1,0.873,6,0.61
48973,HMDPpheno5,css,,48973,HGB,hemoglobin (HGB),,g/dL,,,complete blood count,,HMDP w/par,m,16wks,animal,,2013,,,,83,73,,,,,True,,,False,False,,CXB2/ByJ,m,15.6,1.86,6,1.46
48979,HMDPpheno5,css,,48979,HCT,hematocrit (HCT),,%,,,complete blood count,,HMDP w/par,m,16wks,animal,,2013,,,,83,79,,,,,True,,,False,False,,CXB2/ByJ,m,43.3,5.71,6,0.76
48985,HMDPpheno5,css,,48985,PLT,platelet count (PLT; units per volume x 10<sup>3</sup>),,n/&micro;L,,3,complete blood count,,HMDP w/par,m,16wks,animal,,2013,,,,83,85,,,,,True,,,False,False,,CXB2/ByJ,m,373,104,6,0.95
48991,HMDPpheno5,css,,48991,MPV,mean platelet volume (MPV),,fL,,,complete blood count,,HMDP w/par,m,16wks,animal,,2013,,,,83,91,,,,,True,,,False,False,,CXB2/ByJ,m,5.83,0.294,6,-0.96
50101,HMDPpheno6,css,,50101,Ala,"liver alanine (16h fast), relative abundance",,,,,metabolite quantification,,HMDP w/par,m,16wks,animal,,2014,,,,106,1,,,,,True,,,False,False,,CXB2/ByJ,m,72901499,1513638,3,0.07
50102,HMDPpheno6,css,,50102,Asn,"liver asparagine (16h fast), relative abundance",,,,,metabolite quantification,,HMDP w/par,m,16wks,animal,,2014,,,,106,2,,,,,True,,,False,False,,CXB2/ByJ,m,445118,152031,3,1.27
50103,HMDPpheno6,css,,50103,Asp,"liver aspartate (16h fast), relative abundance",,,,,metabolite quantification,,HMDP w/par,m,16wks,animal,,2014,,,,106,3,,,,,True,,,False,False,,CXB2/ByJ,m,13730340,1318953,3,0.39
50104,HMDPpheno6,css,,50104,beta_Ala,"liver beta-alanine (16h fast), relative abundance",,,,,metabolite quantification,,HMDP w/par,m,16wks,animal,,2014,,,,106,4,,,,,True,,,False,False,,CXB2/ByJ,m,766188,407949,3,0.18
50105,HMDPpheno6,css,,50105,acetyl_Asn,"liver N-acetylasparagine (16h fast), relative abundance",,,,,metabolite quantification,,HMDP w/par,m,16wks,animal,,2014,,,,103,5,,,,,True,,,False,False,,CXB2/ByJ,m,59872,16435,2,-0.31
50106,HMDPpheno6,css,,50106,acetyl_Ala,"liver N-acetylalanine (16h fast), relative abundance",,,,,metabolite quantification,,HMDP w/par,m,16wks,animal,,2014,,,,104,6,,,,,True,,,False,False,,CXB2/ByJ,m,30577,4692,3,1.49
50107,HMDPpheno6,css,,50107,aminobutyrate,"liver 2-aminobutyrate (16h fast), relative abundance",,,,,metabolite quantification,,HMDP w/par,m,16wks,animal,,2014,,,,106,7,,,,,True,,,False,False,,CXB2/ByJ,m,1592147,277991,3,-0.09
50108,HMDPpheno6,css,,50108,creatine,"liver creatine (16h fast), relative abundance",,,,,metabolite quantification,,HMDP w/par,m,16wks,animal,,2014,,,,106,8,,,,,True,,,False,False,,CXB2/ByJ,m,3457062,516226,3,-0.41
50109,HMDPpheno6,css,,50109,AHB,"liver 2-hydroxybutyrate (AHB) (16h fast), relative abundance",,,,,metabolite quantification,,HMDP w/par,m,16wks,animal,,2014,,,,99,9,,,,,True,,,False,False,,CXB2/ByJ,m,205495,60743,3,0.07
50110,HMDPpheno6,css,,50110,Cys,"liver cysteine (16h fast), relative abundance",,,,,metabolite quantification,,HMDP w/par,m,16wks,animal,,2014,,,,106,10,,,,,True,,,False,False,,CXB2/ByJ,m,2231475,1329449,3,2.47
50111,HMDPpheno6,css,,50111,hypotaurine,"liver hypotaurine (16h fast), relative abundance",,,,,metabolite quantification,,HMDP w/par,m,16wks,animal,,2014,,,,106,11,,,,,True,,,False,False,,CXB2/ByJ,m,1038034,455112,3,-0.45
50112,HMDPpheno6,css,,50112,Met,"liver methionine (16h fast), relative abundance",,,,,metabolite quantification,,HMDP w/par,m,16wks,animal,,2014,,,,106,12,,,,,True,,,False,False,,CXB2/ByJ,m,8339076,866327,3,0.93
50113,HMDPpheno6,css,,50113,Met_sulf,"liver methionine sulfoxide (16h fast), relative abundance",,,,,metabolite quantification,,HMDP w/par,m,16wks,animal,,2014,,,,104,13,,,,,True,,,False,False,,CXB2/ByJ,m,224159,87933,3,0.30
50114,HMDPpheno6,css,,50114,taurine,"liver taurine (16h fast), relative abundance",,,,,metabolite quantification,,HMDP w/par,m,16wks,animal,,2014,,,,106,14,,,,,True,,,False,False,,CXB2/ByJ,m,973888,210917,3,-1.07
50115,HMDPpheno6,css,,50115,acetyl_Met,"liver N-acetylmethionine (16h fast), relative abundance",,,,,metabolite quantification,,HMDP w/par,m,16wks,animal,,2014,,,,106,15,,,,,True,,,False,False,,CXB2/ByJ,m,33547,8339,3,1.42
50116,HMDPpheno6,css,,50116,SAH,"liver S-adenosylhomocysteine (SAH) (16h fast), relative abundance",,,,,metabolite quantification,,HMDP w/par,m,16wks,animal,,2014,,,,106,16,,,,,True,,,False,False,,CXB2/ByJ,m,56085,10584,3,1.95
50117,HMDPpheno6,css,,50117,GABA,"liver gamma-aminobutyrate (GABA) (16h fast), relative abundance",,,,,metabolite quantification,,HMDP w/par,m,16wks,animal,,2014,,,,106,17,,,,,True,,,False,False,,CXB2/ByJ,m,399738,181348,3,-0.07
50118,HMDPpheno6,css,,50118,acetyl_Glu,"liver N-acetylglutamate (16h fast), relative abundance",,,,,metabolite quantification,,HMDP w/par,m,16wks,animal,,2014,,,,106,18,,,,,True,,,False,False,,CXB2/ByJ,m,105752,25564,3,-0.43
50119,HMDPpheno6,css,,50119,Gln,"liver glutamine (16h fast), relative abundance",,,,,metabolite quantification,,HMDP w/par,m,16wks,animal,,2014,,,,106,19,,,,,True,,,False,False,,CXB2/ByJ,m,13685864,3696324,3,1.20
50120,HMDPpheno6,css,,50120,Glu,"liver glutamate (16h fast), relative abundance",,,,,metabolite quantification,,HMDP w/par,m,16wks,animal,,2014,,,,106,20,,,,,True,,,False,False,,CXB2/ByJ,m,6526260,1240566,3,0.59
50121,HMDPpheno6,css,,50121,CySSG,"liver cysteine-glutathione disulfide (16h fast), relative abundance",,,,,metabolite quantification,,HMDP w/par,m,16wks,animal,,2014,,,,106,21,,,,,True,,,False,False,,CXB2/ByJ,m,3660239,1684326,3,2.46
50122,HMDPpheno6,css,,50122,GSH,"liver glutathione, reduced (GSH) (16h fast), relative abundance",,,,,metabolite quantification,,HMDP w/par,m,16wks,animal,,2014,,,,104,22,,,,,True,,,False,False,,CXB2/ByJ,m,150250,71608,3,-0.63
50123,HMDPpheno6,css,,50123,GSSG,"liver glutathione, oxidized (GSSG) (16h fast), relative abundance",,,,,metabolite quantification,,HMDP w/par,m,16wks,animal,,2014,,,,106,23,,,,,True,,,False,False,,CXB2/ByJ,m,10297616,3118274,3,-0.86
50124,HMDPpheno6,css,,50124,Me_glutathione,"liver S-methylglutathione (16h fast), relative abundance",,,,,metabolite quantification,,HMDP w/par,m,16wks,animal,,2014,,,,106,24,,,,,True,,,False,False,,CXB2/ByJ,m,159913,72860,3,-0.10
50125,HMDPpheno6,css,,50125,ophthalmate,"liver ophthalmate (16h fast), relative abundance",,,,,metabolite quantification,,HMDP w/par,m,16wks,animal,,2014,,,,106,25,,,,,True,,,False,False,,CXB2/ByJ,m,1217628,442644,3,0.14
50126,HMDPpheno6,css,,50126,oxoproline,"liver 5-oxoproline (16h fast), relative abundance",,,,,metabolite quantification,,HMDP w/par,m,16wks,animal,,2014,,,,106,26,,,,,True,,,False,False,,CXB2/ByJ,m,283314,142107,3,1.34
50127,HMDPpheno6,css,,50127,acetyl_Gly,"liver N-acetylglycine (16h fast), relative abundance",,,,,metabolite quantification,,HMDP w/par,m,16wks,animal,,2014,,,,96,27,,,,,True,,,False,False,,CXB2/ByJ,m,82432,16298,3,0.82
50128,HMDPpheno6,css,,50128,diMe_Gly,"liver dimethylglycine (16h fast), relative abundance",,,,,metabolite quantification,,HMDP w/par,m,16wks,animal,,2014,,,,96,28,,,,,True,,,False,False,,CXB2/ByJ,m,469469,158103,3,1.49
50129,HMDPpheno6,css,,50129,Gly,"liver glycine (16h fast), relative abundance",,,,,metabolite quantification,,HMDP w/par,m,16wks,animal,,2014,,,,106,29,,,,,True,,,False,False,,CXB2/ByJ,m,38348349,4058838,3,0.68
50130,HMDPpheno6,css,,50130,homo_Ser,"liver homoserine (16h fast), relative abundance",,,,,metabolite quantification,,HMDP w/par,m,16wks,animal,,2014,,,,104,30,,,,,True,,,False,False,,CXB2/ByJ,m,9612,0,1,-1.11
50131,HMDPpheno6,css,,50131,Ser,"liver serine (16h fast), relative abundance",,,,,metabolite quantification,,HMDP w/par,m,16wks,animal,,2014,,,,106,31,,,,,True,,,False,False,,CXB2/ByJ,m,33460305,4479588,3,0.75
50132,HMDPpheno6,css,,50132,Thr,"liver threonine (16h fast), relative abundance",,,,,metabolite quantification,,HMDP w/par,m,16wks,animal,,2014,,,,106,32,,,,,True,,,False,False,,CXB2/ByJ,m,10109656,1229202,3,0.80
50133,HMDPpheno6,css,,50133,betaine,"liver betaine (16h fast), relative abundance",,,,,metabolite quantification,,HMDP w/par,m,16wks,animal,,2014,,,,106,33,,,,,True,,,False,False,,CXB2/ByJ,m,8426022,1422831,3,1.02
50134,HMDPpheno6,css,,50134,betaine_aldehyde,"liver betaine aldehyde (16h fast), relative abundance",,,,,metabolite quantification,,HMDP w/par,m,16wks,animal,,2014,,,,106,34,,,,,True,,,False,False,,CXB2/ByJ,m,1491643,133993,3,-0.42
50135,HMDPpheno6,css,,50135,MeC_Gly,"liver 3-methylcrotonylglycine (16h fast), relative abundance",,,,,metabolite quantification,,HMDP w/par,m,16wks,animal,,2014,,,,98,35,,,,,True,,,False,False,,CXB2/ByJ,m,36670,15935,3,-0.34
50136,HMDPpheno6,css,,50136,guanidino,"liver 4-guanidinobutanoate (16h fast), relative abundance",,,,,metabolite quantification,,HMDP w/par,m,16wks,animal,,2014,,,,94,36,,,,,True,,,False,False,,CXB2/ByJ,m,41288,7478,3,-0.25
50137,HMDPpheno6,css,,50137,MeLAA,"liver 1-methylimidazoleacetate (16h fast), relative abundance",,,,,metabolite quantification,,HMDP w/par,m,16wks,animal,,2014,,,,91,37,,,,,True,,,False,False,,CXB2/ByJ,m,48402,9390,3,-0.37
50138,HMDPpheno6,css,,50138,His,"liver histidine (16h fast), relative abundance",,,,,metabolite quantification,,HMDP w/par,m,16wks,animal,,2014,,,,106,38,,,,,True,,,False,False,,CXB2/ByJ,m,370834,57217,3,0.52
50139,HMDPpheno6,css,,50139,glutarate,"liver glutarate (pentanedioate) (16h fast), relative abundance",,,,,metabolite quantification,,HMDP w/par,m,16wks,animal,,2014,,,,100,39,,,,,True,,,False,False,,CXB2/ByJ,m,51587,18199,3,-0.07
50140,HMDPpheno6,css,,50140,acetyl_Lys,"liver N2-acetyllysine (16h fast), relative abundance",,,,,metabolite quantification,,HMDP w/par,m,16wks,animal,,2014,,,,105,40,,,,,True,,,False,False,,CXB2/ByJ,m,49128,4883,3,-0.97
50141,HMDPpheno6,css,,50141,aminoadipate,"liver 2-aminoadipate (16h fast), relative abundance",,,,,metabolite quantification,,HMDP w/par,m,16wks,animal,,2014,,,,98,41,,,,,True,,,False,False,,CXB2/ByJ,m,567696,324468,3,-0.16
50142,HMDPpheno6,css,,50142,GO_carnitine,"liver glutaroyl carnitine (16h fast), relative abundance",,,,,metabolite quantification,,HMDP w/par,m,16wks,animal,,2014,,,,106,42,,,,,True,,,False,False,,CXB2/ByJ,m,903798,339284,3,0.05
50143,HMDPpheno6,css,,50143,Lys,"liver lysine (16h fast), relative abundance",,,,,metabolite quantification,,HMDP w/par,m,16wks,animal,,2014,,,,106,43,,,,,True,,,False,False,,CXB2/ByJ,m,3013387,66536,3,0.38
50144,HMDPpheno6,css,,50144,pipecolate,"liver pipecolate (16h fast), relative abundance",,,,,metabolite quantification,,HMDP w/par,m,16wks,animal,,2014,,,,106,44,,,,,True,,,False,False,,CXB2/ByJ,m,495963,205876,3,0.37
50145,HMDPpheno6,css,,50145,Phe,"liver phenylalanine (16h fast), relative abundance",,,,,metabolite quantification,,HMDP w/par,m,16wks,animal,,2014,,,,106,45,,,,,True,,,False,False,,CXB2/ByJ,m,40605796,4186796,3,0.91
50146,HMDPpheno6,css,,50146,Tyr,"liver tyrosine (16h fast), relative abundance",,,,,metabolite quantification,,HMDP w/par,m,16wks,animal,,2014,,,,106,46,,,,,True,,,False,False,,CXB2/ByJ,m,11765695,1543138,3,0.80
50147,HMDPpheno6,css,,50147,HP_lactate,"liver 3-(4-hydroxyphenyl)lactate (16h fast), relative abundance",,,,,metabolite quantification,,HMDP w/par,m,16wks,animal,,2014,,,,106,47,,,,,True,,,False,False,,CXB2/ByJ,m,23178,4408,3,-0.38
50148,HMDPpheno6,css,,50148,PA_Gly,"liver phenylacetylglycine (16h fast), relative abundance",,,,,metabolite quantification,,HMDP w/par,m,16wks,animal,,2014,,,,105,48,,,,,True,,,False,False,,CXB2/ByJ,m,17914,7300,3,-0.33
50149,HMDPpheno6,css,,50149,phenol_sulfate,"liver phenol sulfate (16h fast), relative abundance",,,,,metabolite quantification,,HMDP w/par,m,16wks,animal,,2014,,,,103,49,,,,,True,,,False,False,,CXB2/ByJ,m,12827,2960,3,-0.87
50150,HMDPpheno6,css,,50150,MTA,"liver 5-methylthioadenosine (MTA) (16h fast), relative abundance",,,,,metabolite quantification,,HMDP w/par,m,16wks,animal,,2014,,,,106,50,,,,,True,,,False,False,,CXB2/ByJ,m,96599,14398,3,1.44
50151,HMDPpheno6,css,,50151,spermidine,"liver spermidine (16h fast), relative abundance",,,,,metabolite quantification,,HMDP w/par,m,16wks,animal,,2014,,,,106,51,,,,,True,,,False,False,,CXB2/ByJ,m,226152,69962,3,-0.66
50152,HMDPpheno6,css,,50152,anthranilate,"liver anthranilate (16h fast), relative abundance",,,,,metabolite quantification,,HMDP w/par,m,16wks,animal,,2014,,,,105,52,,,,,True,,,False,False,,CXB2/ByJ,m,70613,46374,3,-0.14
50153,HMDPpheno6,css,,50153,glycosyl_Trp,"liver C-glycosyltryptophan (16h fast), relative abundance",,,,,metabolite quantification,,HMDP w/par,m,16wks,animal,,2014,,,,106,53,,,,,True,,,False,False,,CXB2/ByJ,m,145046,25674,3,-0.40
50154,HMDPpheno6,css,,50154,kynurenine,"liver kynurenine (16h fast), relative abundance",,,,,metabolite quantification,,HMDP w/par,m,16wks,animal,,2014,,,,106,54,,,,,True,,,False,False,,CXB2/ByJ,m,435417,300803,3,1.17
50155,HMDPpheno6,css,,50155,Trp,"liver tryptophan (16h fast), relative abundance",,,,,metabolite quantification,,HMDP w/par,m,16wks,animal,,2014,,,,106,55,,,,,True,,,False,False,,CXB2/ByJ,m,7509653,244960,3,0.45
50156,HMDPpheno6,css,,50156,kynurenate,"liver kynurenate (16h fast), relative abundance",,,,,metabolite quantification,,HMDP w/par,m,16wks,animal,,2014,,,,105,56,,,,,True,,,False,False,,CXB2/ByJ,m,10332,4436,3,-0.78
50157,HMDPpheno6,css,,50157,hydroxy_Pro,"liver trans-4-hydroxyproline (16h fast), relative abundance",,,,,metabolite quantification,,HMDP w/par,m,16wks,animal,,2014,,,,103,57,,,,,True,,,False,False,,CXB2/ByJ,m,228681,47459,3,0.57
50158,HMDPpheno6,css,,50158,ornithine,"liver ornithine (16h fast), relative abundance",,,,,metabolite quantification,,HMDP w/par,m,16wks,animal,,2014,,,,106,58,,,,,True,,,False,False,,CXB2/ByJ,m,5235685,2477261,3,0.12
50159,HMDPpheno6,css,,50159,urea,"liver urea (16h fast), relative abundance",,,,,metabolite quantification,,HMDP w/par,m,16wks,animal,,2014,,,,106,59,,,,,True,,,False,False,,CXB2/ByJ,m,1150563,632088,3,-0.71
50160,HMDPpheno6,css,,50160,acetylornithine,"liver N-acetylornithine (16h fast), relative abundance",,,,,metabolite quantification,,HMDP w/par,m,16wks,animal,,2014,,,,103,60,,,,,True,,,False,False,,CXB2/ByJ,m,118095,34354,3,0.70
50161,HMDPpheno6,css,,50161,aminovalerate,"liver 5-aminovalerate (16h fast), relative abundance",,,,,metabolite quantification,,HMDP w/par,m,16wks,animal,,2014,,,,106,61,,,,,True,,,False,False,,CXB2/ByJ,m,659193,92853,3,0.07
50162,HMDPpheno6,css,,50162,citrulline,"liver citrulline (16h fast), relative abundance",,,,,metabolite quantification,,HMDP w/par,m,16wks,animal,,2014,,,,106,62,,,,,True,,,False,False,,CXB2/ByJ,m,314230,154072,3,0.45
50163,HMDPpheno6,css,,50163,homostachydrine,"liver homostachydrine (16h fast), relative abundance",,,,,metabolite quantification,,HMDP w/par,m,16wks,animal,,2014,,,,105,63,,,,,True,,,False,False,,CXB2/ByJ,m,179209,53573,3,-0.25
50164,HMDPpheno6,css,,50164,Pro,"liver proline (16h fast), relative abundance",,,,,metabolite quantification,,HMDP w/par,m,16wks,animal,,2014,,,,106,64,,,,,True,,,False,False,,CXB2/ByJ,m,10120582,1071609,3,0.83
50165,HMDPpheno6,css,,50165,SMDA_ADMA,"liver dimethylarginine (SDMA + ADMA) (16h fast), relative abundance",,,,,metabolite quantification,,HMDP w/par,m,16wks,animal,,2014,,,,106,65,,,,,True,,,False,False,,CXB2/ByJ,m,1062828,119625,3,0.23
50166,HMDPpheno6,css,,50166,stachydrine,"liver stachydrine (16h fast), relative abundance",,,,,metabolite quantification,,HMDP w/par,m,16wks,animal,,2014,,,,104,66,,,,,True,,,False,False,,CXB2/ByJ,m,289394,94707,3,0.34
50167,HMDPpheno6,css,,50167,HV_carnitine,"liver hydroxyisovaleroyl carnitine (16h fast), relative abundance",,,,,metabolite quantification,,HMDP w/par,m,16wks,animal,,2014,,,,104,67,,,,,True,,,False,False,,CXB2/ByJ,m,234815,11490,3,-0.36
50168,HMDPpheno6,css,,50168,IB_carnitine,"liver isobutyrylcarnitine (16h fast), relative abundance",,,,,metabolite quantification,,HMDP w/par,m,16wks,animal,,2014,,,,106,68,,,,,True,,,False,False,,CXB2/ByJ,m,136672,80371,3,-0.02
50169,HMDPpheno6,css,,50169,Ile,"liver isoleucine (16h fast), relative abundance",,,,,metabolite quantification,,HMDP w/par,m,16wks,animal,,2014,,,,106,69,,,,,True,,,False,False,,CXB2/ByJ,m,22519862,1345585,3,0.96
50170,HMDPpheno6,css,,50170,IV_carnitine,"liver isovalerylcarnitine (16h fast), relative abundance",,,,,metabolite quantification,,HMDP w/par,m,16wks,animal,,2014,,,,106,70,,,,,True,,,False,False,,CXB2/ByJ,m,89627,32858,3,-0.75
50171,HMDPpheno6,css,,50171,IV_Gly,"liver isovalerylglycine (16h fast), relative abundance",,,,,metabolite quantification,,HMDP w/par,m,16wks,animal,,2014,,,,106,71,,,,,True,,,False,False,,CXB2/ByJ,m,111178,42628,3,-0.32
50172,HMDPpheno6,css,,50172,Leu,"liver leucine (16h fast), relative abundance",,,,,metabolite quantification,,HMDP w/par,m,16wks,animal,,2014,,,,106,72,,,,,True,,,False,False,,CXB2/ByJ,m,46171988,2305057,3,0.89
50173,HMDPpheno6,css,,50173,MeB_carnitine,"liver 2-methylbutyroylcarnitine (16h fast), relative abundance",,,,,metabolite quantification,,HMDP w/par,m,16wks,animal,,2014,,,,105,73,,,,,True,,,False,False,,CXB2/ByJ,m,218112,130038,3,-0.13
50174,HMDPpheno6,css,,50174,MeG_carnitine,"liver methylglutaroylcarnitine (16h fast), relative abundance",,,,,metabolite quantification,,HMDP w/par,m,16wks,animal,,2014,,,,106,74,,,,,True,,,False,False,,CXB2/ByJ,m,2659073,778067,3,0.81
50175,HMDPpheno6,css,,50175,tigloyl_Gly,"liver tigloylglycine (16h fast), relative abundance",,,,,metabolite quantification,,HMDP w/par,m,16wks,animal,,2014,,,,92,75,,,,,True,,,False,False,,CXB2/ByJ,m,45365,2599,3,0.40
50176,HMDPpheno6,css,,50176,tiglyl_carnitine,"liver tiglyl carnitine (16h fast), relative abundance",,,,,metabolite quantification,,HMDP w/par,m,16wks,animal,,2014,,,,106,76,,,,,True,,,False,False,,CXB2/ByJ,m,169684,85571,3,-0.07
50177,HMDPpheno6,css,,50177,Val,"liver valine (16h fast), relative abundance",,,,,metabolite quantification,,HMDP w/par,m,16wks,animal,,2014,,,,106,77,,,,,True,,,False,False,,CXB2/ByJ,m,24140483,2551114,3,0.89
50178,HMDPpheno6,css,,50178,MMA,"liver methylmalonate (MMA) (16h fast), relative abundance",,,,,metabolite quantification,,HMDP w/par,m,16wks,animal,,2014,,,,106,78,,,,,True,,,False,False,,CXB2/ByJ,m,15786,2968,3,-0.51
50201,HMDPpheno7,css,,50201,erythronate,"liver erythronate (16h fast), relative abundance",,,,,metabolite quantification,,HMDP,m,16wks,animal,,2014,,,,102,1,,,,,True,,,False,False,,CXB2/ByJ,m,38378,3976,3,0.73
50202,HMDPpheno7,css,,50202,glucosamine,"liver glucosamine (16h fast), relative abundance",,,,,metabolite quantification,,HMDP,m,16wks,animal,,2014,,,,93,2,,,,,True,,,False,False,,CXB2/ByJ,m,79005,10503,2,-1.21
50203,HMDPpheno7,css,,50203,erythrose,"liver erythrose (16h fast), relative abundance",,,,,metabolite quantification,,HMDP,m,16wks,animal,,2014,,,,106,3,,,,,True,,,False,False,,CXB2/ByJ,m,187934,66490,3,-0.40
50204,HMDPpheno7,css,,50204,fructose,"liver fructose (16h fast), relative abundance",,,,,metabolite quantification,,HMDP,m,16wks,animal,,2014,,,,106,4,,,,,True,,,False,False,,CXB2/ByJ,m,1176978,340689,3,-0.77
50205,HMDPpheno7,css,,50205,maltose,"liver maltose (16h fast), relative abundance",,,,,metabolite quantification,,HMDP,m,16wks,animal,,2014,,,,94,5,,,,,True,,,False,False,,CXB2/ByJ,m,40867730,57707513,2,0.28
50206,HMDPpheno7,css,,50206,mannose,"liver mannose (16h fast), relative abundance",,,,,metabolite quantification,,HMDP,m,16wks,animal,,2014,,,,106,6,,,,,True,,,False,False,,CXB2/ByJ,m,12606212,4099324,3,-0.84
50207,HMDPpheno7,css,,50207,sorbitol,"liver sorbitol (16h fast), relative abundance",,,,,metabolite quantification,,HMDP,m,16wks,animal,,2014,,,,106,7,,,,,True,,,False,False,,CXB2/ByJ,m,364953,437771,3,0.02
50208,HMDPpheno7,css,,50208,maltotetraose,"liver maltotetraose (16h fast), relative abundance",,,,,metabolite quantification,,HMDP,m,16wks,animal,,2014,,,,100,8,,,,,True,,,False,False,,CXB2/ByJ,m,52751,60410,3,-0.31