measnum,projsym,mpdsector,seriestype,keymeasnum,varname,descrip,descrip2,units,datatype,magnitude,method,intervention,paneldesc,sextested,ageweeks,granularity,sourceparm,projyear,extname,reference,association,nstrainstested,listorder,label,supplemental,native_method,is_covar,is_measure,upload_factors,file_column,is_baseline,is_control,private,strain,sex,mean,sd,nmice,zscore
42202,Donahue13,css,,42202,litter_interval,mean litter interval,,wks,,,colony observation,,CXB,f,3-50wks,animal,,2011,,,,13,2,,,,,True,,,False,False,,CXB9/HiAJ,f,4.15,0.784,8,-1.26
42203,Donahue13,css,,42203,litter_size_birth,mean number of pups born,,n,,,colony observation,,CXB,f,3-50wks,animal,,2011,,,,13,3,,,,,True,,,False,False,,CXB9/HiAJ,f,6.86,1.39,8,0.57
42204,Donahue13,css,,42204,litter_size_wean,mean number of pups weaned,,n,,,colony observation,,CXB,f,3-50wks,animal,,2011,,,,13,4,,,,,True,,,False,False,,CXB9/HiAJ,f,5.99,1.32,8,0.23
42205,Donahue13,css,,42205,ratio_wean_born,ratio of pups weaned to pups born,,ratio,,,colony observation,,CXB,f,3-50wks,animal,,2011,,,,13,5,,,,,True,,,False,False,,CXB9/HiAJ,f,0.900,0.0926,8,-0.37
42206,Donahue13,css,,42206,fecundity_index,mean litter size divided by mean litter interval,,n/wks,,,colony observation,,CXB,f,3-50wks,animal,,2011,,,,13,6,,,,,True,,,False,False,,CXB9/HiAJ,f,1.67,0.318,8,1.49
42207,Donahue13,css,,42207,pct_Fwean,percent females at weaning,,%,,,colony observation,,CXB,f,3-50wks,animal,,2011,,,,13,7,,,,,True,,,False,False,,CXB9/HiAJ,f,46.8,14.5,8,-0.17
48901,HMDPpheno5,css,,48901,WBC,white blood cell count (WBC; units per volume x 10<sup>3</sup>),,n/&micro;L,,3,complete blood count,,HMDP w/par,m,16wks,animal,,2013,,,,79,1,,,,,True,,,False,False,,CXB9/HiAJ,m,6.23,4.48,6,1.47
48907,HMDPpheno5,css,,48907,LYM,lymphocyte count (LYM; units per volume x 10<sup>3</sup>),,n/&micro;L,,3,complete blood count,,HMDP w/par,m,16wks,animal,,2013,,,,79,7,,,,,True,,,False,False,,CXB9/HiAJ,m,4.43,3.42,6,1.49
48913,HMDPpheno5,css,,48913,pct_LYM,lymphocyte differential (LYM; percentage of viable WBC),,%,,,complete blood count,,HMDP w/par,m,16wks,animal,,2013,,,,79,13,,,,,True,,,False,False,,CXB9/HiAJ,m,71.3,8.88,6,0.46
48919,HMDPpheno5,css,,48919,MONO,monocyte count (MONO; units per volume x 10<sup>3</sup>),,n/&micro;L,,3,complete blood count,,HMDP w/par,m,16wks,animal,,2013,,,,79,19,,,,,True,,,False,False,,CXB9/HiAJ,m,0.450,0.251,6,0.91
48925,HMDPpheno5,css,,48925,pct_MONO,monocyte differential (MONO; percentage of viable WBC),,%,,,complete blood count,,HMDP w/par,m,16wks,animal,,2013,,,,79,25,,,,,True,,,False,False,,CXB9/HiAJ,m,6.47,1.07,6,-0.31
48931,HMDPpheno5,css,,48931,GRA,granulocyte count (GRA; units per volume x 10<sup>3</sup>),,n/&micro;L,,3,complete blood count,,HMDP w/par,m,16wks,animal,,2013,,,,79,31,,,,,True,,,False,False,,CXB9/HiAJ,m,1.35,1.09,6,1.44
48937,HMDPpheno5,css,,48937,pct_GRA,granulocyte differential (GRA; percentage of total viable WBC),,%,,,complete blood count,,HMDP w/par,m,16wks,animal,,2013,,,,79,37,,,,,True,,,False,False,,CXB9/HiAJ,m,22.2,8.13,6,-0.46
48943,HMDPpheno5,css,,48943,RBC,red blood cell count (RBC; units per volume x 10<sup>6</sup>),,n/&micro;L,,6,complete blood count,,HMDP w/par,m,16wks,animal,,2013,,,,83,43,,,,,True,,,False,False,,CXB9/HiAJ,m,8.98,0.685,7,0.35
48949,HMDPpheno5,css,,48949,MCV,mean RBC corpuscular volume (MCV),,fL,,,complete blood count,,HMDP w/par,m,16wks,animal,,2013,,,,83,49,,,,,True,,,False,False,,CXB9/HiAJ,m,44.6,0.680,7,0.04
48955,HMDPpheno5,css,,48955,RDW,RBC corpuscular distribution width (RDW),,%,,,complete blood count,,HMDP w/par,m,16wks,animal,,2013,,,,83,55,,,,,True,,,False,False,,CXB9/HiAJ,m,17.0,0.234,7,-0.01
48961,HMDPpheno5,css,,48961,MCH,mean RBC corpuscular hemoglobin (MCH),,pg,,,complete blood count,,HMDP w/par,m,16wks,animal,,2013,,,,83,61,,,,,True,,,False,False,,CXB9/HiAJ,m,15.6,0.224,7,0.59
48967,HMDPpheno5,css,,48967,MCHC,mean RBC corpuscular hemoglobin concentration (MCHC),,g/dL,,,complete blood count,,HMDP w/par,m,16wks,animal,,2013,,,,83,67,,,,,True,,,False,False,,CXB9/HiAJ,m,35.0,0.907,7,0.25
48973,HMDPpheno5,css,,48973,HGB,hemoglobin (HGB),,g/dL,,,complete blood count,,HMDP w/par,m,16wks,animal,,2013,,,,83,73,,,,,True,,,False,False,,CXB9/HiAJ,m,14.0,0.966,7,0.68
48979,HMDPpheno5,css,,48979,HCT,hematocrit (HCT),,%,,,complete blood count,,HMDP w/par,m,16wks,animal,,2013,,,,83,79,,,,,True,,,False,False,,CXB9/HiAJ,m,40.1,3.27,7,0.34
48985,HMDPpheno5,css,,48985,PLT,platelet count (PLT; units per volume x 10<sup>3</sup>),,n/&micro;L,,3,complete blood count,,HMDP w/par,m,16wks,animal,,2013,,,,83,85,,,,,True,,,False,False,,CXB9/HiAJ,m,302,105,7,0.22
48991,HMDPpheno5,css,,48991,MPV,mean platelet volume (MPV),,fL,,,complete blood count,,HMDP w/par,m,16wks,animal,,2013,,,,83,91,,,,,True,,,False,False,,CXB9/HiAJ,m,6.27,0.170,7,0.13
50101,HMDPpheno6,css,,50101,Ala,"liver alanine (16h fast), relative abundance",,,,,metabolite quantification,,HMDP w/par,m,16wks,animal,,2014,,,,106,1,,,,,True,,,False,False,,CXB9/HiAJ,m,84517995,11229177,3,0.88
50102,HMDPpheno6,css,,50102,Asn,"liver asparagine (16h fast), relative abundance",,,,,metabolite quantification,,HMDP w/par,m,16wks,animal,,2014,,,,106,2,,,,,True,,,False,False,,CXB9/HiAJ,m,493695,210800,3,1.68
50103,HMDPpheno6,css,,50103,Asp,"liver aspartate (16h fast), relative abundance",,,,,metabolite quantification,,HMDP w/par,m,16wks,animal,,2014,,,,106,3,,,,,True,,,False,False,,CXB9/HiAJ,m,11375709,1925071,3,-0.28
50104,HMDPpheno6,css,,50104,beta_Ala,"liver beta-alanine (16h fast), relative abundance",,,,,metabolite quantification,,HMDP w/par,m,16wks,animal,,2014,,,,106,4,,,,,True,,,False,False,,CXB9/HiAJ,m,898868,95238,3,0.74
50105,HMDPpheno6,css,,50105,acetyl_Asn,"liver N-acetylasparagine (16h fast), relative abundance",,,,,metabolite quantification,,HMDP w/par,m,16wks,animal,,2014,,,,103,5,,,,,True,,,False,False,,CXB9/HiAJ,m,53530,12513,3,-0.55
50106,HMDPpheno6,css,,50106,acetyl_Ala,"liver N-acetylalanine (16h fast), relative abundance",,,,,metabolite quantification,,HMDP w/par,m,16wks,animal,,2014,,,,104,6,,,,,True,,,False,False,,CXB9/HiAJ,m,34022,2102,3,2.09
50107,HMDPpheno6,css,,50107,aminobutyrate,"liver 2-aminobutyrate (16h fast), relative abundance",,,,,metabolite quantification,,HMDP w/par,m,16wks,animal,,2014,,,,106,7,,,,,True,,,False,False,,CXB9/HiAJ,m,1273398,175337,3,-0.37
50108,HMDPpheno6,css,,50108,creatine,"liver creatine (16h fast), relative abundance",,,,,metabolite quantification,,HMDP w/par,m,16wks,animal,,2014,,,,106,8,,,,,True,,,False,False,,CXB9/HiAJ,m,3907365,422477,3,0.15
50109,HMDPpheno6,css,,50109,AHB,"liver 2-hydroxybutyrate (AHB) (16h fast), relative abundance",,,,,metabolite quantification,,HMDP w/par,m,16wks,animal,,2014,,,,99,9,,,,,True,,,False,False,,CXB9/HiAJ,m,161672,4657,3,-0.27
50110,HMDPpheno6,css,,50110,Cys,"liver cysteine (16h fast), relative abundance",,,,,metabolite quantification,,HMDP w/par,m,16wks,animal,,2014,,,,106,10,,,,,True,,,False,False,,CXB9/HiAJ,m,2238818,1291299,3,2.49
50111,HMDPpheno6,css,,50111,hypotaurine,"liver hypotaurine (16h fast), relative abundance",,,,,metabolite quantification,,HMDP w/par,m,16wks,animal,,2014,,,,106,11,,,,,True,,,False,False,,CXB9/HiAJ,m,1268206,258748,3,-0.22
50112,HMDPpheno6,css,,50112,Met,"liver methionine (16h fast), relative abundance",,,,,metabolite quantification,,HMDP w/par,m,16wks,animal,,2014,,,,106,12,,,,,True,,,False,False,,CXB9/HiAJ,m,7855522,450818,3,0.59
50113,HMDPpheno6,css,,50113,Met_sulf,"liver methionine sulfoxide (16h fast), relative abundance",,,,,metabolite quantification,,HMDP w/par,m,16wks,animal,,2014,,,,104,13,,,,,True,,,False,False,,CXB9/HiAJ,m,145570,25006,3,-0.42
50114,HMDPpheno6,css,,50114,taurine,"liver taurine (16h fast), relative abundance",,,,,metabolite quantification,,HMDP w/par,m,16wks,animal,,2014,,,,106,14,,,,,True,,,False,False,,CXB9/HiAJ,m,1004748,328614,3,-0.96
50115,HMDPpheno6,css,,50115,acetyl_Met,"liver N-acetylmethionine (16h fast), relative abundance",,,,,metabolite quantification,,HMDP w/par,m,16wks,animal,,2014,,,,106,15,,,,,True,,,False,False,,CXB9/HiAJ,m,36805,6074,3,1.85
50116,HMDPpheno6,css,,50116,SAH,"liver S-adenosylhomocysteine (SAH) (16h fast), relative abundance",,,,,metabolite quantification,,HMDP w/par,m,16wks,animal,,2014,,,,106,16,,,,,True,,,False,False,,CXB9/HiAJ,m,27860,4504,3,-1.44
50117,HMDPpheno6,css,,50117,GABA,"liver gamma-aminobutyrate (GABA) (16h fast), relative abundance",,,,,metabolite quantification,,HMDP w/par,m,16wks,animal,,2014,,,,106,17,,,,,True,,,False,False,,CXB9/HiAJ,m,506293,92621,3,0.63
50118,HMDPpheno6,css,,50118,acetyl_Glu,"liver N-acetylglutamate (16h fast), relative abundance",,,,,metabolite quantification,,HMDP w/par,m,16wks,animal,,2014,,,,106,18,,,,,True,,,False,False,,CXB9/HiAJ,m,61310,9312,3,-0.65
50119,HMDPpheno6,css,,50119,Gln,"liver glutamine (16h fast), relative abundance",,,,,metabolite quantification,,HMDP w/par,m,16wks,animal,,2014,,,,106,19,,,,,True,,,False,False,,CXB9/HiAJ,m,11058791,1785032,3,-0.34
50120,HMDPpheno6,css,,50120,Glu,"liver glutamate (16h fast), relative abundance",,,,,metabolite quantification,,HMDP w/par,m,16wks,animal,,2014,,,,106,20,,,,,True,,,False,False,,CXB9/HiAJ,m,6689116,477146,3,0.70
50121,HMDPpheno6,css,,50121,CySSG,"liver cysteine-glutathione disulfide (16h fast), relative abundance",,,,,metabolite quantification,,HMDP w/par,m,16wks,animal,,2014,,,,106,21,,,,,True,,,False,False,,CXB9/HiAJ,m,3868843,1922482,3,2.81
50122,HMDPpheno6,css,,50122,GSH,"liver glutathione, reduced (GSH) (16h fast), relative abundance",,,,,metabolite quantification,,HMDP w/par,m,16wks,animal,,2014,,,,104,22,,,,,True,,,False,False,,CXB9/HiAJ,m,145705,109432,3,-0.65
50123,HMDPpheno6,css,,50123,GSSG,"liver glutathione, oxidized (GSSG) (16h fast), relative abundance",,,,,metabolite quantification,,HMDP w/par,m,16wks,animal,,2014,,,,106,23,,,,,True,,,False,False,,CXB9/HiAJ,m,9697962,4317917,3,-1.14
50124,HMDPpheno6,css,,50124,Me_glutathione,"liver S-methylglutathione (16h fast), relative abundance",,,,,metabolite quantification,,HMDP w/par,m,16wks,animal,,2014,,,,106,24,,,,,True,,,False,False,,CXB9/HiAJ,m,191495,37337,3,0.33
50125,HMDPpheno6,css,,50125,ophthalmate,"liver ophthalmate (16h fast), relative abundance",,,,,metabolite quantification,,HMDP w/par,m,16wks,animal,,2014,,,,106,25,,,,,True,,,False,False,,CXB9/HiAJ,m,958739,216994,3,-0.11
50126,HMDPpheno6,css,,50126,oxoproline,"liver 5-oxoproline (16h fast), relative abundance",,,,,metabolite quantification,,HMDP w/par,m,16wks,animal,,2014,,,,106,26,,,,,True,,,False,False,,CXB9/HiAJ,m,243475,52059,3,0.70
50127,HMDPpheno6,css,,50127,acetyl_Gly,"liver N-acetylglycine (16h fast), relative abundance",,,,,metabolite quantification,,HMDP w/par,m,16wks,animal,,2014,,,,96,27,,,,,True,,,False,False,,CXB9/HiAJ,m,84307,20843,3,0.90
50128,HMDPpheno6,css,,50128,diMe_Gly,"liver dimethylglycine (16h fast), relative abundance",,,,,metabolite quantification,,HMDP w/par,m,16wks,animal,,2014,,,,96,28,,,,,True,,,False,False,,CXB9/HiAJ,m,270979,32196,2,0.07
50129,HMDPpheno6,css,,50129,Gly,"liver glycine (16h fast), relative abundance",,,,,metabolite quantification,,HMDP w/par,m,16wks,animal,,2014,,,,106,29,,,,,True,,,False,False,,CXB9/HiAJ,m,37445083,4501383,3,0.53
50130,HMDPpheno6,css,,50130,homo_Ser,"liver homoserine (16h fast), relative abundance",,,,,metabolite quantification,,HMDP w/par,m,16wks,animal,,2014,,,,104,30,,,,,True,,,False,False,,CXB9/HiAJ,m,34609,2299,3,-0.68
50131,HMDPpheno6,css,,50131,Ser,"liver serine (16h fast), relative abundance",,,,,metabolite quantification,,HMDP w/par,m,16wks,animal,,2014,,,,106,31,,,,,True,,,False,False,,CXB9/HiAJ,m,31997979,2388174,3,0.54
50132,HMDPpheno6,css,,50132,Thr,"liver threonine (16h fast), relative abundance",,,,,metabolite quantification,,HMDP w/par,m,16wks,animal,,2014,,,,106,32,,,,,True,,,False,False,,CXB9/HiAJ,m,10170564,229725,3,0.83
50133,HMDPpheno6,css,,50133,betaine,"liver betaine (16h fast), relative abundance",,,,,metabolite quantification,,HMDP w/par,m,16wks,animal,,2014,,,,106,33,,,,,True,,,False,False,,CXB9/HiAJ,m,4240768,627068,3,-0.97
50134,HMDPpheno6,css,,50134,betaine_aldehyde,"liver betaine aldehyde (16h fast), relative abundance",,,,,metabolite quantification,,HMDP w/par,m,16wks,animal,,2014,,,,106,34,,,,,True,,,False,False,,CXB9/HiAJ,m,953531,487573,3,-2.14
50135,HMDPpheno6,css,,50135,MeC_Gly,"liver 3-methylcrotonylglycine (16h fast), relative abundance",,,,,metabolite quantification,,HMDP w/par,m,16wks,animal,,2014,,,,98,35,,,,,True,,,False,False,,CXB9/HiAJ,m,18133,0,1,-1.26
50136,HMDPpheno6,css,,50136,guanidino,"liver 4-guanidinobutanoate (16h fast), relative abundance",,,,,metabolite quantification,,HMDP w/par,m,16wks,animal,,2014,,,,94,36,,,,,True,,,False,False,,CXB9/HiAJ,m,39888,11164,2,-0.27
50137,HMDPpheno6,css,,50137,MeLAA,"liver 1-methylimidazoleacetate (16h fast), relative abundance",,,,,metabolite quantification,,HMDP w/par,m,16wks,animal,,2014,,,,91,37,,,,,True,,,False,False,,CXB9/HiAJ,m,44613,20725,2,-0.44
50138,HMDPpheno6,css,,50138,His,"liver histidine (16h fast), relative abundance",,,,,metabolite quantification,,HMDP w/par,m,16wks,animal,,2014,,,,106,38,,,,,True,,,False,False,,CXB9/HiAJ,m,385932,25105,3,0.73
50139,HMDPpheno6,css,,50139,glutarate,"liver glutarate (pentanedioate) (16h fast), relative abundance",,,,,metabolite quantification,,HMDP w/par,m,16wks,animal,,2014,,,,100,39,,,,,True,,,False,False,,CXB9/HiAJ,m,31545,2092,3,-0.17
50140,HMDPpheno6,css,,50140,acetyl_Lys,"liver N2-acetyllysine (16h fast), relative abundance",,,,,metabolite quantification,,HMDP w/par,m,16wks,animal,,2014,,,,105,40,,,,,True,,,False,False,,CXB9/HiAJ,m,70587,13619,3,-0.43
50141,HMDPpheno6,css,,50141,aminoadipate,"liver 2-aminoadipate (16h fast), relative abundance",,,,,metabolite quantification,,HMDP w/par,m,16wks,animal,,2014,,,,98,41,,,,,True,,,False,False,,CXB9/HiAJ,m,238992,52485,3,-0.23
50142,HMDPpheno6,css,,50142,GO_carnitine,"liver glutaroyl carnitine (16h fast), relative abundance",,,,,metabolite quantification,,HMDP w/par,m,16wks,animal,,2014,,,,106,42,,,,,True,,,False,False,,CXB9/HiAJ,m,821725,234557,3,0.02
50143,HMDPpheno6,css,,50143,Lys,"liver lysine (16h fast), relative abundance",,,,,metabolite quantification,,HMDP w/par,m,16wks,animal,,2014,,,,106,43,,,,,True,,,False,False,,CXB9/HiAJ,m,2944941,134342,3,0.24
50144,HMDPpheno6,css,,50144,pipecolate,"liver pipecolate (16h fast), relative abundance",,,,,metabolite quantification,,HMDP w/par,m,16wks,animal,,2014,,,,106,44,,,,,True,,,False,False,,CXB9/HiAJ,m,247028,68402,3,-0.86
50145,HMDPpheno6,css,,50145,Phe,"liver phenylalanine (16h fast), relative abundance",,,,,metabolite quantification,,HMDP w/par,m,16wks,animal,,2014,,,,106,45,,,,,True,,,False,False,,CXB9/HiAJ,m,39394785,742164,3,0.72
50146,HMDPpheno6,css,,50146,Tyr,"liver tyrosine (16h fast), relative abundance",,,,,metabolite quantification,,HMDP w/par,m,16wks,animal,,2014,,,,106,46,,,,,True,,,False,False,,CXB9/HiAJ,m,12834153,1841460,3,1.20
50147,HMDPpheno6,css,,50147,HP_lactate,"liver 3-(4-hydroxyphenyl)lactate (16h fast), relative abundance",,,,,metabolite quantification,,HMDP w/par,m,16wks,animal,,2014,,,,106,47,,,,,True,,,False,False,,CXB9/HiAJ,m,26462,4414,3,0.08
50148,HMDPpheno6,css,,50148,PA_Gly,"liver phenylacetylglycine (16h fast), relative abundance",,,,,metabolite quantification,,HMDP w/par,m,16wks,animal,,2014,,,,105,48,,,,,True,,,False,False,,CXB9/HiAJ,m,19669,5815,3,-0.18
50149,HMDPpheno6,css,,50149,phenol_sulfate,"liver phenol sulfate (16h fast), relative abundance",,,,,metabolite quantification,,HMDP w/par,m,16wks,animal,,2014,,,,103,49,,,,,True,,,False,False,,CXB9/HiAJ,m,46688,15192,3,0.68
50150,HMDPpheno6,css,,50150,MTA,"liver 5-methylthioadenosine (MTA) (16h fast), relative abundance",,,,,metabolite quantification,,HMDP w/par,m,16wks,animal,,2014,,,,106,50,,,,,True,,,False,False,,CXB9/HiAJ,m,126384,116547,3,2.53
50151,HMDPpheno6,css,,50151,spermidine,"liver spermidine (16h fast), relative abundance",,,,,metabolite quantification,,HMDP w/par,m,16wks,animal,,2014,,,,106,51,,,,,True,,,False,False,,CXB9/HiAJ,m,199427,1201,3,-0.84
50152,HMDPpheno6,css,,50152,anthranilate,"liver anthranilate (16h fast), relative abundance",,,,,metabolite quantification,,HMDP w/par,m,16wks,animal,,2014,,,,105,52,,,,,True,,,False,False,,CXB9/HiAJ,m,44524,11960,3,-0.77
50153,HMDPpheno6,css,,50153,glycosyl_Trp,"liver C-glycosyltryptophan (16h fast), relative abundance",,,,,metabolite quantification,,HMDP w/par,m,16wks,animal,,2014,,,,106,53,,,,,True,,,False,False,,CXB9/HiAJ,m,150331,20039,3,-0.25
50154,HMDPpheno6,css,,50154,kynurenine,"liver kynurenine (16h fast), relative abundance",,,,,metabolite quantification,,HMDP w/par,m,16wks,animal,,2014,,,,106,54,,,,,True,,,False,False,,CXB9/HiAJ,m,165903,46752,3,-0.61
50155,HMDPpheno6,css,,50155,Trp,"liver tryptophan (16h fast), relative abundance",,,,,metabolite quantification,,HMDP w/par,m,16wks,animal,,2014,,,,106,55,,,,,True,,,False,False,,CXB9/HiAJ,m,7825088,303807,3,0.66
50156,HMDPpheno6,css,,50156,kynurenate,"liver kynurenate (16h fast), relative abundance",,,,,metabolite quantification,,HMDP w/par,m,16wks,animal,,2014,,,,105,56,,,,,True,,,False,False,,CXB9/HiAJ,m,5882,1102,3,-1.12
50157,HMDPpheno6,css,,50157,hydroxy_Pro,"liver trans-4-hydroxyproline (16h fast), relative abundance",,,,,metabolite quantification,,HMDP w/par,m,16wks,animal,,2014,,,,103,57,,,,,True,,,False,False,,CXB9/HiAJ,m,198446,62427,3,0.23
50158,HMDPpheno6,css,,50158,ornithine,"liver ornithine (16h fast), relative abundance",,,,,metabolite quantification,,HMDP w/par,m,16wks,animal,,2014,,,,106,58,,,,,True,,,False,False,,CXB9/HiAJ,m,5529225,887664,3,0.25
50159,HMDPpheno6,css,,50159,urea,"liver urea (16h fast), relative abundance",,,,,metabolite quantification,,HMDP w/par,m,16wks,animal,,2014,,,,106,59,,,,,True,,,False,False,,CXB9/HiAJ,m,1275402,278707,3,-0.59
50160,HMDPpheno6,css,,50160,acetylornithine,"liver N-acetylornithine (16h fast), relative abundance",,,,,metabolite quantification,,HMDP w/par,m,16wks,animal,,2014,,,,103,60,,,,,True,,,False,False,,CXB9/HiAJ,m,56562,12935,3,-0.86
50161,HMDPpheno6,css,,50161,aminovalerate,"liver 5-aminovalerate (16h fast), relative abundance",,,,,metabolite quantification,,HMDP w/par,m,16wks,animal,,2014,,,,106,61,,,,,True,,,False,False,,CXB9/HiAJ,m,1079094,188301,3,2.14
50162,HMDPpheno6,css,,50162,citrulline,"liver citrulline (16h fast), relative abundance",,,,,metabolite quantification,,HMDP w/par,m,16wks,animal,,2014,,,,106,62,,,,,True,,,False,False,,CXB9/HiAJ,m,250224,59987,3,-0.28
50163,HMDPpheno6,css,,50163,homostachydrine,"liver homostachydrine (16h fast), relative abundance",,,,,metabolite quantification,,HMDP w/par,m,16wks,animal,,2014,,,,105,63,,,,,True,,,False,False,,CXB9/HiAJ,m,69990,18050,3,-0.98
50164,HMDPpheno6,css,,50164,Pro,"liver proline (16h fast), relative abundance",,,,,metabolite quantification,,HMDP w/par,m,16wks,animal,,2014,,,,106,64,,,,,True,,,False,False,,CXB9/HiAJ,m,11714853,1041348,3,1.70
50165,HMDPpheno6,css,,50165,SMDA_ADMA,"liver dimethylarginine (SDMA + ADMA) (16h fast), relative abundance",,,,,metabolite quantification,,HMDP w/par,m,16wks,animal,,2014,,,,106,65,,,,,True,,,False,False,,CXB9/HiAJ,m,840627,67597,3,-0.48
50166,HMDPpheno6,css,,50166,stachydrine,"liver stachydrine (16h fast), relative abundance",,,,,metabolite quantification,,HMDP w/par,m,16wks,animal,,2014,,,,104,66,,,,,True,,,False,False,,CXB9/HiAJ,m,53693,22665,3,-1.01
50167,HMDPpheno6,css,,50167,HV_carnitine,"liver hydroxyisovaleroyl carnitine (16h fast), relative abundance",,,,,metabolite quantification,,HMDP w/par,m,16wks,animal,,2014,,,,104,67,,,,,True,,,False,False,,CXB9/HiAJ,m,145515,33012,3,-1.19
50168,HMDPpheno6,css,,50168,IB_carnitine,"liver isobutyrylcarnitine (16h fast), relative abundance",,,,,metabolite quantification,,HMDP w/par,m,16wks,animal,,2014,,,,106,68,,,,,True,,,False,False,,CXB9/HiAJ,m,101686,76151,3,-0.52
50169,HMDPpheno6,css,,50169,Ile,"liver isoleucine (16h fast), relative abundance",,,,,metabolite quantification,,HMDP w/par,m,16wks,animal,,2014,,,,106,69,,,,,True,,,False,False,,CXB9/HiAJ,m,22467617,1655313,3,0.95
50170,HMDPpheno6,css,,50170,IV_carnitine,"liver isovalerylcarnitine (16h fast), relative abundance",,,,,metabolite quantification,,HMDP w/par,m,16wks,animal,,2014,,,,106,70,,,,,True,,,False,False,,CXB9/HiAJ,m,59173,40051,2,-0.96
50171,HMDPpheno6,css,,50171,IV_Gly,"liver isovalerylglycine (16h fast), relative abundance",,,,,metabolite quantification,,HMDP w/par,m,16wks,animal,,2014,,,,106,71,,,,,True,,,False,False,,CXB9/HiAJ,m,81902,29178,3,-0.88
50172,HMDPpheno6,css,,50172,Leu,"liver leucine (16h fast), relative abundance",,,,,metabolite quantification,,HMDP w/par,m,16wks,animal,,2014,,,,106,72,,,,,True,,,False,False,,CXB9/HiAJ,m,44806900,4388378,3,0.71
50173,HMDPpheno6,css,,50173,MeB_carnitine,"liver 2-methylbutyroylcarnitine (16h fast), relative abundance",,,,,metabolite quantification,,HMDP w/par,m,16wks,animal,,2014,,,,105,73,,,,,True,,,False,False,,CXB9/HiAJ,m,101565,70455,3,-0.92
50174,HMDPpheno6,css,,50174,MeG_carnitine,"liver methylglutaroylcarnitine (16h fast), relative abundance",,,,,metabolite quantification,,HMDP w/par,m,16wks,animal,,2014,,,,106,74,,,,,True,,,False,False,,CXB9/HiAJ,m,1840700,496573,3,0.09
50175,HMDPpheno6,css,,50175,tigloyl_Gly,"liver tigloylglycine (16h fast), relative abundance",,,,,metabolite quantification,,HMDP w/par,m,16wks,animal,,2014,,,,92,75,,,,,True,,,False,False,,CXB9/HiAJ,m,45435,16540,3,0.41
50176,HMDPpheno6,css,,50176,tiglyl_carnitine,"liver tiglyl carnitine (16h fast), relative abundance",,,,,metabolite quantification,,HMDP w/par,m,16wks,animal,,2014,,,,106,76,,,,,True,,,False,False,,CXB9/HiAJ,m,108777,22575,3,-0.90
50177,HMDPpheno6,css,,50177,Val,"liver valine (16h fast), relative abundance",,,,,metabolite quantification,,HMDP w/par,m,16wks,animal,,2014,,,,106,77,,,,,True,,,False,False,,CXB9/HiAJ,m,23573809,282577,3,0.74
50178,HMDPpheno6,css,,50178,MMA,"liver methylmalonate (MMA) (16h fast), relative abundance",,,,,metabolite quantification,,HMDP w/par,m,16wks,animal,,2014,,,,106,78,,,,,True,,,False,False,,CXB9/HiAJ,m,23541,3528,3,-0.24
50201,HMDPpheno7,css,,50201,erythronate,"liver erythronate (16h fast), relative abundance",,,,,metabolite quantification,,HMDP,m,16wks,animal,,2014,,,,102,1,,,,,True,,,False,False,,CXB9/HiAJ,m,30618,13387,3,-0.12
50202,HMDPpheno7,css,,50202,glucosamine,"liver glucosamine (16h fast), relative abundance",,,,,metabolite quantification,,HMDP,m,16wks,animal,,2014,,,,93,2,,,,,True,,,False,False,,CXB9/HiAJ,m,89753,28886,2,-1.01
50203,HMDPpheno7,css,,50203,erythrose,"liver erythrose (16h fast), relative abundance",,,,,metabolite quantification,,HMDP,m,16wks,animal,,2014,,,,106,3,,,,,True,,,False,False,,CXB9/HiAJ,m,171224,33995,3,-0.61
50204,HMDPpheno7,css,,50204,fructose,"liver fructose (16h fast), relative abundance",,,,,metabolite quantification,,HMDP,m,16wks,animal,,2014,,,,106,4,,,,,True,,,False,False,,CXB9/HiAJ,m,1210882,258745,3,-0.70
50205,HMDPpheno7,css,,50205,maltose,"liver maltose (16h fast), relative abundance",,,,,metabolite quantification,,HMDP,m,16wks,animal,,2014,,,,94,5,,,,,True,,,False,False,,CXB9/HiAJ,m,1965373,2669450,3,-0.45
50206,HMDPpheno7,css,,50206,mannose,"liver mannose (16h fast), relative abundance",,,,,metabolite quantification,,HMDP,m,16wks,animal,,2014,,,,106,6,,,,,True,,,False,False,,CXB9/HiAJ,m,10502262,1692998,3,-1.13
50207,HMDPpheno7,css,,50207,sorbitol,"liver sorbitol (16h fast), relative abundance",,,,,metabolite quantification,,HMDP,m,16wks,animal,,2014,,,,106,7,,,,,True,,,False,False,,CXB9/HiAJ,m,300692,89786,3,-0.24
50208,HMDPpheno7,css,,50208,maltotetraose,"liver maltotetraose (16h fast), relative abundance",,,,,metabolite quantification,,HMDP,m,16wks,animal,,2014,,,,100,8,,,,,True,,,False,False,,CXB9/HiAJ,m,109219,77380,3,-0.19