measnum,projsym,mpdsector,seriestype,keymeasnum,varname,descrip,descrip2,units,datatype,magnitude,method,intervention,paneldesc,sextested,ageweeks,granularity,sourceparm,projyear,extname,reference,association,nstrainstested,listorder,label,supplemental,native_method,is_covar,is_measure,upload_factors,file_column,is_baseline,is_control,private,strain,sex,mean,sd,nmice,zscore
42202,Donahue13,css,,42202,litter_interval,mean litter interval,,wks,,,colony observation,,CXB,f,3-50wks,animal,,2011,,,,13,2,,,,,True,,,False,False,,CXB12/HiAJ,f,4.02,0.715,8,-1.43
42203,Donahue13,css,,42203,litter_size_birth,mean number of pups born,,n,,,colony observation,,CXB,f,3-50wks,animal,,2011,,,,13,3,,,,,True,,,False,False,,CXB12/HiAJ,f,6.64,1.09,8,0.34
42204,Donahue13,css,,42204,litter_size_wean,mean number of pups weaned,,n,,,colony observation,,CXB,f,3-50wks,animal,,2011,,,,13,4,,,,,True,,,False,False,,CXB12/HiAJ,f,6.54,1.17,8,0.87
42205,Donahue13,css,,42205,ratio_wean_born,ratio of pups weaned to pups born,,ratio,,,colony observation,,CXB,f,3-50wks,animal,,2011,,,,13,5,,,,,True,,,False,False,,CXB12/HiAJ,f,0.988,0.0354,8,1.45
42206,Donahue13,css,,42206,fecundity_index,mean litter size divided by mean litter interval,,n/wks,,,colony observation,,CXB,f,3-50wks,animal,,2011,,,,13,6,,,,,True,,,False,False,,CXB12/HiAJ,f,1.71,0.452,8,1.64
42207,Donahue13,css,,42207,pct_Fwean,percent females at weaning,,%,,,colony observation,,CXB,f,3-50wks,animal,,2011,,,,13,7,,,,,True,,,False,False,,CXB12/HiAJ,f,47.8,8.84,8,0.02
48901,HMDPpheno5,css,,48901,WBC,white blood cell count (WBC; units per volume x 10<sup>3</sup>),,n/&micro;L,,3,complete blood count,,HMDP w/par,m,16wks,animal,,2013,,,,79,1,,,,,True,,,False,False,,CXB12/HiAJ,m,9.77,1.96,8,3.40
48907,HMDPpheno5,css,,48907,LYM,lymphocyte count (LYM; units per volume x 10<sup>3</sup>),,n/&micro;L,,3,complete blood count,,HMDP w/par,m,16wks,animal,,2013,,,,79,7,,,,,True,,,False,False,,CXB12/HiAJ,m,7.19,1.19,8,3.56
48913,HMDPpheno5,css,,48913,pct_LYM,lymphocyte differential (LYM; percentage of viable WBC),,%,,,complete blood count,,HMDP w/par,m,16wks,animal,,2013,,,,79,13,,,,,True,,,False,False,,CXB12/HiAJ,m,74.2,4.67,8,1.03
48919,HMDPpheno5,css,,48919,MONO,monocyte count (MONO; units per volume x 10<sup>3</sup>),,n/&micro;L,,3,complete blood count,,HMDP w/par,m,16wks,animal,,2013,,,,79,19,,,,,True,,,False,False,,CXB12/HiAJ,m,0.825,0.249,8,3.21
48925,HMDPpheno5,css,,48925,pct_MONO,monocyte differential (MONO; percentage of viable WBC),,%,,,complete blood count,,HMDP w/par,m,16wks,animal,,2013,,,,79,25,,,,,True,,,False,False,,CXB12/HiAJ,m,7.64,1.27,8,0.46
48931,HMDPpheno5,css,,48931,GRA,granulocyte count (GRA; units per volume x 10<sup>3</sup>),,n/&micro;L,,3,complete blood count,,HMDP w/par,m,16wks,animal,,2013,,,,79,31,,,,,True,,,False,False,,CXB12/HiAJ,m,1.76,0.667,8,2.49
48937,HMDPpheno5,css,,48937,pct_GRA,granulocyte differential (GRA; percentage of total viable WBC),,%,,,complete blood count,,HMDP w/par,m,16wks,animal,,2013,,,,79,37,,,,,True,,,False,False,,CXB12/HiAJ,m,18.2,3.89,8,-1.40
48943,HMDPpheno5,css,,48943,RBC,red blood cell count (RBC; units per volume x 10<sup>6</sup>),,n/&micro;L,,6,complete blood count,,HMDP w/par,m,16wks,animal,,2013,,,,83,43,,,,,True,,,False,False,,CXB12/HiAJ,m,10.7,0.511,8,1.47
48949,HMDPpheno5,css,,48949,MCV,mean RBC corpuscular volume (MCV),,fL,,,complete blood count,,HMDP w/par,m,16wks,animal,,2013,,,,83,49,,,,,True,,,False,False,,CXB12/HiAJ,m,50.0,0.691,8,1.44
48955,HMDPpheno5,css,,48955,RDW,RBC corpuscular distribution width (RDW),,%,,,complete blood count,,HMDP w/par,m,16wks,animal,,2013,,,,83,55,,,,,True,,,False,False,,CXB12/HiAJ,m,16.3,0.382,8,-0.56
48961,HMDPpheno5,css,,48961,MCH,mean RBC corpuscular hemoglobin (MCH),,pg,,,complete blood count,,HMDP w/par,m,16wks,animal,,2013,,,,83,61,,,,,True,,,False,False,,CXB12/HiAJ,m,15.2,0.396,8,0.11
48967,HMDPpheno5,css,,48967,MCHC,mean RBC corpuscular hemoglobin concentration (MCHC),,g/dL,,,complete blood count,,HMDP w/par,m,16wks,animal,,2013,,,,83,67,,,,,True,,,False,False,,CXB12/HiAJ,m,30.4,0.940,8,-1.23
48973,HMDPpheno5,css,,48973,HGB,hemoglobin (HGB),,g/dL,,,complete blood count,,HMDP w/par,m,16wks,animal,,2013,,,,83,73,,,,,True,,,False,False,,CXB12/HiAJ,m,16.3,0.794,8,1.81
48979,HMDPpheno5,css,,48979,HCT,hematocrit (HCT),,%,,,complete blood count,,HMDP w/par,m,16wks,animal,,2013,,,,83,79,,,,,True,,,False,False,,CXB12/HiAJ,m,53.7,3.08,8,2.14
48985,HMDPpheno5,css,,48985,PLT,platelet count (PLT; units per volume x 10<sup>3</sup>),,n/&micro;L,,3,complete blood count,,HMDP w/par,m,16wks,animal,,2013,,,,83,85,,,,,True,,,False,False,,CXB12/HiAJ,m,347,58.7,8,0.69
48991,HMDPpheno5,css,,48991,MPV,mean platelet volume (MPV),,fL,,,complete blood count,,HMDP w/par,m,16wks,animal,,2013,,,,83,91,,,,,True,,,False,False,,CXB12/HiAJ,m,6.33,0.369,8,0.28
50101,HMDPpheno6,css,,50101,Ala,"liver alanine (16h fast), relative abundance",,,,,metabolite quantification,,HMDP w/par,m,16wks,animal,,2014,,,,106,1,,,,,True,,,False,False,,CXB12/HiAJ,m,73943008,820821,2,0.14
50102,HMDPpheno6,css,,50102,Asn,"liver asparagine (16h fast), relative abundance",,,,,metabolite quantification,,HMDP w/par,m,16wks,animal,,2014,,,,106,2,,,,,True,,,False,False,,CXB12/HiAJ,m,486598,245870,2,1.62
50103,HMDPpheno6,css,,50103,Asp,"liver aspartate (16h fast), relative abundance",,,,,metabolite quantification,,HMDP w/par,m,16wks,animal,,2014,,,,106,3,,,,,True,,,False,False,,CXB12/HiAJ,m,13231009,1015821,2,0.24
50104,HMDPpheno6,css,,50104,beta_Ala,"liver beta-alanine (16h fast), relative abundance",,,,,metabolite quantification,,HMDP w/par,m,16wks,animal,,2014,,,,106,4,,,,,True,,,False,False,,CXB12/HiAJ,m,658152,188832,2,-0.27
50105,HMDPpheno6,css,,50105,acetyl_Asn,"liver N-acetylasparagine (16h fast), relative abundance",,,,,metabolite quantification,,HMDP w/par,m,16wks,animal,,2014,,,,103,5,,,,,True,,,False,False,,CXB12/HiAJ,m,53450,9883,2,-0.55
50106,HMDPpheno6,css,,50106,acetyl_Ala,"liver N-acetylalanine (16h fast), relative abundance",,,,,metabolite quantification,,HMDP w/par,m,16wks,animal,,2014,,,,104,6,,,,,True,,,False,False,,CXB12/HiAJ,m,38285,3326,2,2.83
50107,HMDPpheno6,css,,50107,aminobutyrate,"liver 2-aminobutyrate (16h fast), relative abundance",,,,,metabolite quantification,,HMDP w/par,m,16wks,animal,,2014,,,,106,7,,,,,True,,,False,False,,CXB12/HiAJ,m,2943727,146476,2,1.10
50108,HMDPpheno6,css,,50108,creatine,"liver creatine (16h fast), relative abundance",,,,,metabolite quantification,,HMDP w/par,m,16wks,animal,,2014,,,,106,8,,,,,True,,,False,False,,CXB12/HiAJ,m,3761750,22081,2,-0.03
50109,HMDPpheno6,css,,50109,AHB,"liver 2-hydroxybutyrate (AHB) (16h fast), relative abundance",,,,,metabolite quantification,,HMDP w/par,m,16wks,animal,,2014,,,,99,9,,,,,True,,,False,False,,CXB12/HiAJ,m,335684,11270,2,1.09
50110,HMDPpheno6,css,,50110,Cys,"liver cysteine (16h fast), relative abundance",,,,,metabolite quantification,,HMDP w/par,m,16wks,animal,,2014,,,,106,10,,,,,True,,,False,False,,CXB12/HiAJ,m,2301063,855914,2,2.66
50111,HMDPpheno6,css,,50111,hypotaurine,"liver hypotaurine (16h fast), relative abundance",,,,,metabolite quantification,,HMDP w/par,m,16wks,animal,,2014,,,,106,11,,,,,True,,,False,False,,CXB12/HiAJ,m,1482084,381322,2,-0.01
50112,HMDPpheno6,css,,50112,Met,"liver methionine (16h fast), relative abundance",,,,,metabolite quantification,,HMDP w/par,m,16wks,animal,,2014,,,,106,12,,,,,True,,,False,False,,CXB12/HiAJ,m,8200699,146969,2,0.83
50113,HMDPpheno6,css,,50113,Met_sulf,"liver methionine sulfoxide (16h fast), relative abundance",,,,,metabolite quantification,,HMDP w/par,m,16wks,animal,,2014,,,,104,13,,,,,True,,,False,False,,CXB12/HiAJ,m,235692,95132,2,0.41
50114,HMDPpheno6,css,,50114,taurine,"liver taurine (16h fast), relative abundance",,,,,metabolite quantification,,HMDP w/par,m,16wks,animal,,2014,,,,106,14,,,,,True,,,False,False,,CXB12/HiAJ,m,833326,14591,2,-1.59
50115,HMDPpheno6,css,,50115,acetyl_Met,"liver N-acetylmethionine (16h fast), relative abundance",,,,,metabolite quantification,,HMDP w/par,m,16wks,animal,,2014,,,,106,15,,,,,True,,,False,False,,CXB12/HiAJ,m,45096,8371,2,2.94
50116,HMDPpheno6,css,,50116,SAH,"liver S-adenosylhomocysteine (SAH) (16h fast), relative abundance",,,,,metabolite quantification,,HMDP w/par,m,16wks,animal,,2014,,,,106,16,,,,,True,,,False,False,,CXB12/HiAJ,m,34811,7454,2,-0.60
50117,HMDPpheno6,css,,50117,GABA,"liver gamma-aminobutyrate (GABA) (16h fast), relative abundance",,,,,metabolite quantification,,HMDP w/par,m,16wks,animal,,2014,,,,106,17,,,,,True,,,False,False,,CXB12/HiAJ,m,396213,36511,2,-0.09
50118,HMDPpheno6,css,,50118,acetyl_Glu,"liver N-acetylglutamate (16h fast), relative abundance",,,,,metabolite quantification,,HMDP w/par,m,16wks,animal,,2014,,,,106,18,,,,,True,,,False,False,,CXB12/HiAJ,m,152788,51318,2,-0.19
50119,HMDPpheno6,css,,50119,Gln,"liver glutamine (16h fast), relative abundance",,,,,metabolite quantification,,HMDP w/par,m,16wks,animal,,2014,,,,106,19,,,,,True,,,False,False,,CXB12/HiAJ,m,13785142,2609426,2,1.25
50120,HMDPpheno6,css,,50120,Glu,"liver glutamate (16h fast), relative abundance",,,,,metabolite quantification,,HMDP w/par,m,16wks,animal,,2014,,,,106,20,,,,,True,,,False,False,,CXB12/HiAJ,m,5810378,88070,2,0.08
50121,HMDPpheno6,css,,50121,CySSG,"liver cysteine-glutathione disulfide (16h fast), relative abundance",,,,,metabolite quantification,,HMDP w/par,m,16wks,animal,,2014,,,,106,21,,,,,True,,,False,False,,CXB12/HiAJ,m,3962704,844624,2,2.97
50122,HMDPpheno6,css,,50122,GSH,"liver glutathione, reduced (GSH) (16h fast), relative abundance",,,,,metabolite quantification,,HMDP w/par,m,16wks,animal,,2014,,,,104,22,,,,,True,,,False,False,,CXB12/HiAJ,m,132642,11717,2,-0.73
50123,HMDPpheno6,css,,50123,GSSG,"liver glutathione, oxidized (GSSG) (16h fast), relative abundance",,,,,metabolite quantification,,HMDP w/par,m,16wks,animal,,2014,,,,106,23,,,,,True,,,False,False,,CXB12/HiAJ,m,9101612,1796482,2,-1.43
50124,HMDPpheno6,css,,50124,Me_glutathione,"liver S-methylglutathione (16h fast), relative abundance",,,,,metabolite quantification,,HMDP w/par,m,16wks,animal,,2014,,,,106,24,,,,,True,,,False,False,,CXB12/HiAJ,m,120260,6312,2,-0.63
50125,HMDPpheno6,css,,50125,ophthalmate,"liver ophthalmate (16h fast), relative abundance",,,,,metabolite quantification,,HMDP w/par,m,16wks,animal,,2014,,,,106,25,,,,,True,,,False,False,,CXB12/HiAJ,m,1655042,398858,2,0.56
50126,HMDPpheno6,css,,50126,oxoproline,"liver 5-oxoproline (16h fast), relative abundance",,,,,metabolite quantification,,HMDP w/par,m,16wks,animal,,2014,,,,106,26,,,,,True,,,False,False,,CXB12/HiAJ,m,270150,79087,2,1.13
50127,HMDPpheno6,css,,50127,acetyl_Gly,"liver N-acetylglycine (16h fast), relative abundance",,,,,metabolite quantification,,HMDP w/par,m,16wks,animal,,2014,,,,96,27,,,,,True,,,False,False,,CXB12/HiAJ,m,105354,7679,2,1.81
50128,HMDPpheno6,css,,50128,diMe_Gly,"liver dimethylglycine (16h fast), relative abundance",,,,,metabolite quantification,,HMDP w/par,m,16wks,animal,,2014,,,,96,28,,,,,True,,,False,False,,CXB12/HiAJ,m,303263,170468,2,0.30
50129,HMDPpheno6,css,,50129,Gly,"liver glycine (16h fast), relative abundance",,,,,metabolite quantification,,HMDP w/par,m,16wks,animal,,2014,,,,106,29,,,,,True,,,False,False,,CXB12/HiAJ,m,38023840,2661375,2,0.63
50130,HMDPpheno6,css,,50130,homo_Ser,"liver homoserine (16h fast), relative abundance",,,,,metabolite quantification,,HMDP w/par,m,16wks,animal,,2014,,,,104,30,,,,,True,,,False,False,,CXB12/HiAJ,m,29247,6912,2,-0.77
50131,HMDPpheno6,css,,50131,Ser,"liver serine (16h fast), relative abundance",,,,,metabolite quantification,,HMDP w/par,m,16wks,animal,,2014,,,,106,31,,,,,True,,,False,False,,CXB12/HiAJ,m,32548598,4054627,2,0.62
50132,HMDPpheno6,css,,50132,Thr,"liver threonine (16h fast), relative abundance",,,,,metabolite quantification,,HMDP w/par,m,16wks,animal,,2014,,,,106,32,,,,,True,,,False,False,,CXB12/HiAJ,m,10028780,1784183,2,0.76
50133,HMDPpheno6,css,,50133,betaine,"liver betaine (16h fast), relative abundance",,,,,metabolite quantification,,HMDP w/par,m,16wks,animal,,2014,,,,106,33,,,,,True,,,False,False,,CXB12/HiAJ,m,8056222,2291208,2,0.85
50134,HMDPpheno6,css,,50134,betaine_aldehyde,"liver betaine aldehyde (16h fast), relative abundance",,,,,metabolite quantification,,HMDP w/par,m,16wks,animal,,2014,,,,106,34,,,,,True,,,False,False,,CXB12/HiAJ,m,803377,62693,2,-2.62
50135,HMDPpheno6,css,,50135,MeC_Gly,"liver 3-methylcrotonylglycine (16h fast), relative abundance",,,,,metabolite quantification,,HMDP w/par,m,16wks,animal,,2014,,,,98,35,,,,,True,,,False,False,,CXB12/HiAJ,m,22226,3103,2,-1.06
50136,HMDPpheno6,css,,50136,guanidino,"liver 4-guanidinobutanoate (16h fast), relative abundance",,,,,metabolite quantification,,HMDP w/par,m,16wks,animal,,2014,,,,94,36,,,,,True,,,False,False,,CXB12/HiAJ,m,18780,0,1,-0.52
50137,HMDPpheno6,css,,50137,MeLAA,"liver 1-methylimidazoleacetate (16h fast), relative abundance",,,,,metabolite quantification,,HMDP w/par,m,16wks,animal,,2014,,,,91,37,,,,,True,,,False,False,,CXB12/HiAJ,m,78427,17116,2,0.16
50138,HMDPpheno6,css,,50138,His,"liver histidine (16h fast), relative abundance",,,,,metabolite quantification,,HMDP w/par,m,16wks,animal,,2014,,,,106,38,,,,,True,,,False,False,,CXB12/HiAJ,m,405295,30111,2,0.99
50139,HMDPpheno6,css,,50139,glutarate,"liver glutarate (pentanedioate) (16h fast), relative abundance",,,,,metabolite quantification,,HMDP w/par,m,16wks,animal,,2014,,,,100,39,,,,,True,,,False,False,,CXB12/HiAJ,m,41602,16825,2,-0.12
50140,HMDPpheno6,css,,50140,acetyl_Lys,"liver N2-acetyllysine (16h fast), relative abundance",,,,,metabolite quantification,,HMDP w/par,m,16wks,animal,,2014,,,,105,40,,,,,True,,,False,False,,CXB12/HiAJ,m,74517,31304,2,-0.33
50141,HMDPpheno6,css,,50141,aminoadipate,"liver 2-aminoadipate (16h fast), relative abundance",,,,,metabolite quantification,,HMDP w/par,m,16wks,animal,,2014,,,,98,41,,,,,True,,,False,False,,CXB12/HiAJ,m,206951,118104,2,-0.24
50142,HMDPpheno6,css,,50142,GO_carnitine,"liver glutaroyl carnitine (16h fast), relative abundance",,,,,metabolite quantification,,HMDP w/par,m,16wks,animal,,2014,,,,106,42,,,,,True,,,False,False,,CXB12/HiAJ,m,341966,32560,2,-0.17
50143,HMDPpheno6,css,,50143,Lys,"liver lysine (16h fast), relative abundance",,,,,metabolite quantification,,HMDP w/par,m,16wks,animal,,2014,,,,106,43,,,,,True,,,False,False,,CXB12/HiAJ,m,3221248,236670,2,0.82
50144,HMDPpheno6,css,,50144,pipecolate,"liver pipecolate (16h fast), relative abundance",,,,,metabolite quantification,,HMDP w/par,m,16wks,animal,,2014,,,,106,44,,,,,True,,,False,False,,CXB12/HiAJ,m,164365,73611,2,-1.27
50145,HMDPpheno6,css,,50145,Phe,"liver phenylalanine (16h fast), relative abundance",,,,,metabolite quantification,,HMDP w/par,m,16wks,animal,,2014,,,,106,45,,,,,True,,,False,False,,CXB12/HiAJ,m,43901900,1300307,2,1.42
50146,HMDPpheno6,css,,50146,Tyr,"liver tyrosine (16h fast), relative abundance",,,,,metabolite quantification,,HMDP w/par,m,16wks,animal,,2014,,,,106,46,,,,,True,,,False,False,,CXB12/HiAJ,m,12933812,78832,2,1.24
50147,HMDPpheno6,css,,50147,HP_lactate,"liver 3-(4-hydroxyphenyl)lactate (16h fast), relative abundance",,,,,metabolite quantification,,HMDP w/par,m,16wks,animal,,2014,,,,106,47,,,,,True,,,False,False,,CXB12/HiAJ,m,29376,5410,2,0.49
50148,HMDPpheno6,css,,50148,PA_Gly,"liver phenylacetylglycine (16h fast), relative abundance",,,,,metabolite quantification,,HMDP w/par,m,16wks,animal,,2014,,,,105,48,,,,,True,,,False,False,,CXB12/HiAJ,m,23315,112,2,0.12
50149,HMDPpheno6,css,,50149,phenol_sulfate,"liver phenol sulfate (16h fast), relative abundance",,,,,metabolite quantification,,HMDP w/par,m,16wks,animal,,2014,,,,103,49,,,,,True,,,False,False,,CXB12/HiAJ,m,45550,6440,2,0.63
50150,HMDPpheno6,css,,50150,MTA,"liver 5-methylthioadenosine (MTA) (16h fast), relative abundance",,,,,metabolite quantification,,HMDP w/par,m,16wks,animal,,2014,,,,106,50,,,,,True,,,False,False,,CXB12/HiAJ,m,187188,74653,2,4.74
50151,HMDPpheno6,css,,50151,spermidine,"liver spermidine (16h fast), relative abundance",,,,,metabolite quantification,,HMDP w/par,m,16wks,animal,,2014,,,,106,51,,,,,True,,,False,False,,CXB12/HiAJ,m,177134,32706,2,-0.98
50152,HMDPpheno6,css,,50152,anthranilate,"liver anthranilate (16h fast), relative abundance",,,,,metabolite quantification,,HMDP w/par,m,16wks,animal,,2014,,,,105,52,,,,,True,,,False,False,,CXB12/HiAJ,m,31677,12341,2,-1.08
50153,HMDPpheno6,css,,50153,glycosyl_Trp,"liver C-glycosyltryptophan (16h fast), relative abundance",,,,,metabolite quantification,,HMDP w/par,m,16wks,animal,,2014,,,,106,53,,,,,True,,,False,False,,CXB12/HiAJ,m,154686,4604,2,-0.12
50154,HMDPpheno6,css,,50154,kynurenine,"liver kynurenine (16h fast), relative abundance",,,,,metabolite quantification,,HMDP w/par,m,16wks,animal,,2014,,,,106,54,,,,,True,,,False,False,,CXB12/HiAJ,m,178876,15468,2,-0.52
50155,HMDPpheno6,css,,50155,Trp,"liver tryptophan (16h fast), relative abundance",,,,,metabolite quantification,,HMDP w/par,m,16wks,animal,,2014,,,,106,55,,,,,True,,,False,False,,CXB12/HiAJ,m,8518756,812827,2,1.11
50156,HMDPpheno6,css,,50156,kynurenate,"liver kynurenate (16h fast), relative abundance",,,,,metabolite quantification,,HMDP w/par,m,16wks,animal,,2014,,,,105,56,,,,,True,,,False,False,,CXB12/HiAJ,m,4292,0,1,-1.24
50157,HMDPpheno6,css,,50157,hydroxy_Pro,"liver trans-4-hydroxyproline (16h fast), relative abundance",,,,,metabolite quantification,,HMDP w/par,m,16wks,animal,,2014,,,,103,57,,,,,True,,,False,False,,CXB12/HiAJ,m,233633,38104,2,0.62
50158,HMDPpheno6,css,,50158,ornithine,"liver ornithine (16h fast), relative abundance",,,,,metabolite quantification,,HMDP w/par,m,16wks,animal,,2014,,,,106,58,,,,,True,,,False,False,,CXB12/HiAJ,m,5078897,528937,2,0.05
50159,HMDPpheno6,css,,50159,urea,"liver urea (16h fast), relative abundance",,,,,metabolite quantification,,HMDP w/par,m,16wks,animal,,2014,,,,106,59,,,,,True,,,False,False,,CXB12/HiAJ,m,1145107,648134,2,-0.71
50160,HMDPpheno6,css,,50160,acetylornithine,"liver N-acetylornithine (16h fast), relative abundance",,,,,metabolite quantification,,HMDP w/par,m,16wks,animal,,2014,,,,103,60,,,,,True,,,False,False,,CXB12/HiAJ,m,81846,3245,2,-0.22
50161,HMDPpheno6,css,,50161,aminovalerate,"liver 5-aminovalerate (16h fast), relative abundance",,,,,metabolite quantification,,HMDP w/par,m,16wks,animal,,2014,,,,106,61,,,,,True,,,False,False,,CXB12/HiAJ,m,711638,127471,2,0.33
50162,HMDPpheno6,css,,50162,citrulline,"liver citrulline (16h fast), relative abundance",,,,,metabolite quantification,,HMDP w/par,m,16wks,animal,,2014,,,,106,62,,,,,True,,,False,False,,CXB12/HiAJ,m,251303,5559,2,-0.27
50163,HMDPpheno6,css,,50163,homostachydrine,"liver homostachydrine (16h fast), relative abundance",,,,,metabolite quantification,,HMDP w/par,m,16wks,animal,,2014,,,,105,63,,,,,True,,,False,False,,CXB12/HiAJ,m,185589,21194,2,-0.21
50164,HMDPpheno6,css,,50164,Pro,"liver proline (16h fast), relative abundance",,,,,metabolite quantification,,HMDP w/par,m,16wks,animal,,2014,,,,106,64,,,,,True,,,False,False,,CXB12/HiAJ,m,12361524,252093,2,2.05
50165,HMDPpheno6,css,,50165,SMDA_ADMA,"liver dimethylarginine (SDMA + ADMA) (16h fast), relative abundance",,,,,metabolite quantification,,HMDP w/par,m,16wks,animal,,2014,,,,106,65,,,,,True,,,False,False,,CXB12/HiAJ,m,1140786,155092,2,0.47
50166,HMDPpheno6,css,,50166,stachydrine,"liver stachydrine (16h fast), relative abundance",,,,,metabolite quantification,,HMDP w/par,m,16wks,animal,,2014,,,,104,66,,,,,True,,,False,False,,CXB12/HiAJ,m,220996,50720,2,-0.05
50167,HMDPpheno6,css,,50167,HV_carnitine,"liver hydroxyisovaleroyl carnitine (16h fast), relative abundance",,,,,metabolite quantification,,HMDP w/par,m,16wks,animal,,2014,,,,104,67,,,,,True,,,False,False,,CXB12/HiAJ,m,301705,88630,2,0.25
50168,HMDPpheno6,css,,50168,IB_carnitine,"liver isobutyrylcarnitine (16h fast), relative abundance",,,,,metabolite quantification,,HMDP w/par,m,16wks,animal,,2014,,,,106,68,,,,,True,,,False,False,,CXB12/HiAJ,m,240101,126106,2,1.45
50169,HMDPpheno6,css,,50169,Ile,"liver isoleucine (16h fast), relative abundance",,,,,metabolite quantification,,HMDP w/par,m,16wks,animal,,2014,,,,106,69,,,,,True,,,False,False,,CXB12/HiAJ,m,23943346,668807,2,1.35
50170,HMDPpheno6,css,,50170,IV_carnitine,"liver isovalerylcarnitine (16h fast), relative abundance",,,,,metabolite quantification,,HMDP w/par,m,16wks,animal,,2014,,,,106,70,,,,,True,,,False,False,,CXB12/HiAJ,m,96238,17906,2,-0.71
50171,HMDPpheno6,css,,50171,IV_Gly,"liver isovalerylglycine (16h fast), relative abundance",,,,,metabolite quantification,,HMDP w/par,m,16wks,animal,,2014,,,,106,71,,,,,True,,,False,False,,CXB12/HiAJ,m,112652,4471,2,-0.30
50172,HMDPpheno6,css,,50172,Leu,"liver leucine (16h fast), relative abundance",,,,,metabolite quantification,,HMDP w/par,m,16wks,animal,,2014,,,,106,72,,,,,True,,,False,False,,CXB12/HiAJ,m,50676182,2223424,2,1.51
50173,HMDPpheno6,css,,50173,MeB_carnitine,"liver 2-methylbutyroylcarnitine (16h fast), relative abundance",,,,,metabolite quantification,,HMDP w/par,m,16wks,animal,,2014,,,,105,73,,,,,True,,,False,False,,CXB12/HiAJ,m,225145,68193,2,-0.09
50174,HMDPpheno6,css,,50174,MeG_carnitine,"liver methylglutaroylcarnitine (16h fast), relative abundance",,,,,metabolite quantification,,HMDP w/par,m,16wks,animal,,2014,,,,106,74,,,,,True,,,False,False,,CXB12/HiAJ,m,1551029,565,2,-0.17
50175,HMDPpheno6,css,,50175,tigloyl_Gly,"liver tigloylglycine (16h fast), relative abundance",,,,,metabolite quantification,,HMDP w/par,m,16wks,animal,,2014,,,,92,75,,,,,True,,,False,False,,CXB12/HiAJ,m,53269,16622,2,1.05
50176,HMDPpheno6,css,,50176,tiglyl_carnitine,"liver tiglyl carnitine (16h fast), relative abundance",,,,,metabolite quantification,,HMDP w/par,m,16wks,animal,,2014,,,,106,76,,,,,True,,,False,False,,CXB12/HiAJ,m,224555,78002,2,0.69
50177,HMDPpheno6,css,,50177,Val,"liver valine (16h fast), relative abundance",,,,,metabolite quantification,,HMDP w/par,m,16wks,animal,,2014,,,,106,77,,,,,True,,,False,False,,CXB12/HiAJ,m,23585435,1923988,2,0.74
50178,HMDPpheno6,css,,50178,MMA,"liver methylmalonate (MMA) (16h fast), relative abundance",,,,,metabolite quantification,,HMDP w/par,m,16wks,animal,,2014,,,,106,78,,,,,True,,,False,False,,CXB12/HiAJ,m,17172,3067,2,-0.47
50201,HMDPpheno7,css,,50201,erythronate,"liver erythronate (16h fast), relative abundance",,,,,metabolite quantification,,HMDP,m,16wks,animal,,2014,,,,102,1,,,,,True,,,False,False,,CXB12/HiAJ,m,28171,5090,2,-0.39
50202,HMDPpheno7,css,,50202,glucosamine,"liver glucosamine (16h fast), relative abundance",,,,,metabolite quantification,,HMDP,m,16wks,animal,,2014,,,,93,2,,,,,True,,,False,False,,CXB12/HiAJ,m,97254,9295,2,-0.86
50203,HMDPpheno7,css,,50203,erythrose,"liver erythrose (16h fast), relative abundance",,,,,metabolite quantification,,HMDP,m,16wks,animal,,2014,,,,106,3,,,,,True,,,False,False,,CXB12/HiAJ,m,168137,19634,2,-0.65
50204,HMDPpheno7,css,,50204,fructose,"liver fructose (16h fast), relative abundance",,,,,metabolite quantification,,HMDP,m,16wks,animal,,2014,,,,106,4,,,,,True,,,False,False,,CXB12/HiAJ,m,1224910,174864,2,-0.68
50205,HMDPpheno7,css,,50205,maltose,"liver maltose (16h fast), relative abundance",,,,,metabolite quantification,,HMDP,m,16wks,animal,,2014,,,,94,5,,,,,True,,,False,False,,CXB12/HiAJ,m,5723999,7137099,2,-0.38
50206,HMDPpheno7,css,,50206,mannose,"liver mannose (16h fast), relative abundance",,,,,metabolite quantification,,HMDP,m,16wks,animal,,2014,,,,106,6,,,,,True,,,False,False,,CXB12/HiAJ,m,11744638,1512584,2,-0.96
50207,HMDPpheno7,css,,50207,sorbitol,"liver sorbitol (16h fast), relative abundance",,,,,metabolite quantification,,HMDP,m,16wks,animal,,2014,,,,106,7,,,,,True,,,False,False,,CXB12/HiAJ,m,233716,3504,2,-0.52
50208,HMDPpheno7,css,,50208,maltotetraose,"liver maltotetraose (16h fast), relative abundance",,,,,metabolite quantification,,HMDP,m,16wks,animal,,2014,,,,100,8,,,,,True,,,False,False,,CXB12/HiAJ,m,120965,13984,2,-0.17