measnum,projsym,mpdsector,seriestype,keymeasnum,varname,descrip,descrip2,units,datatype,magnitude,method,intervention,paneldesc,sextested,ageweeks,granularity,sourceparm,projyear,extname,reference,association,nstrainstested,listorder,label,supplemental,native_method,is_covar,is_measure,upload_factors,file_column,is_baseline,is_control,private,strain,sex,mean,sd,nmice,zscore
42202,Donahue13,css,,42202,litter_interval,mean litter interval,,wks,,,colony observation,,CXB,f,3-50wks,animal,,2011,,,,13,2,,,,,True,,,False,False,,CXB1/ByJ,f,5.41,1.60,7,0.35
42203,Donahue13,css,,42203,litter_size_birth,mean number of pups born,,n,,,colony observation,,CXB,f,3-50wks,animal,,2011,,,,13,3,,,,,True,,,False,False,,CXB1/ByJ,f,4.86,0.770,7,-1.53
42204,Donahue13,css,,42204,litter_size_wean,mean number of pups weaned,,n,,,colony observation,,CXB,f,3-50wks,animal,,2011,,,,13,4,,,,,True,,,False,False,,CXB1/ByJ,f,4.54,0.779,7,-1.46
42205,Donahue13,css,,42205,ratio_wean_born,ratio of pups weaned to pups born,,ratio,,,colony observation,,CXB,f,3-50wks,animal,,2011,,,,13,5,,,,,True,,,False,False,,CXB1/ByJ,f,0.943,0.0535,7,0.52
42206,Donahue13,css,,42206,fecundity_index,mean litter size divided by mean litter interval,,n/wks,,,colony observation,,CXB,f,3-50wks,animal,,2011,,,,13,6,,,,,True,,,False,False,,CXB1/ByJ,f,0.927,0.152,7,-1.30
42207,Donahue13,css,,42207,pct_Fwean,percent females at weaning,,%,,,colony observation,,CXB,f,3-50wks,animal,,2011,,,,13,7,,,,,True,,,False,False,,CXB1/ByJ,f,47.6,13.3,7,-0.02
48901,HMDPpheno5,css,,48901,WBC,white blood cell count (WBC; units per volume x 10<sup>3</sup>),,n/&micro;L,,3,complete blood count,,HMDP w/par,m,16wks,animal,,2013,,,,79,1,,,,,True,,,False,False,,CXB1/ByJ,m,6.49,2.98,8,1.61
48907,HMDPpheno5,css,,48907,LYM,lymphocyte count (LYM; units per volume x 10<sup>3</sup>),,n/&micro;L,,3,complete blood count,,HMDP w/par,m,16wks,animal,,2013,,,,79,7,,,,,True,,,False,False,,CXB1/ByJ,m,4.82,2.25,8,1.78
48913,HMDPpheno5,css,,48913,pct_LYM,lymphocyte differential (LYM; percentage of viable WBC),,%,,,complete blood count,,HMDP w/par,m,16wks,animal,,2013,,,,79,13,,,,,True,,,False,False,,CXB1/ByJ,m,74.0,4.59,8,0.99
48919,HMDPpheno5,css,,48919,MONO,monocyte count (MONO; units per volume x 10<sup>3</sup>),,n/&micro;L,,3,complete blood count,,HMDP w/par,m,16wks,animal,,2013,,,,79,19,,,,,True,,,False,False,,CXB1/ByJ,m,0.550,0.207,8,1.52
48925,HMDPpheno5,css,,48925,pct_MONO,monocyte differential (MONO; percentage of viable WBC),,%,,,complete blood count,,HMDP w/par,m,16wks,animal,,2013,,,,79,25,,,,,True,,,False,False,,CXB1/ByJ,m,7.81,0.919,8,0.57
48931,HMDPpheno5,css,,48931,GRA,granulocyte count (GRA; units per volume x 10<sup>3</sup>),,n/&micro;L,,3,complete blood count,,HMDP w/par,m,16wks,animal,,2013,,,,79,31,,,,,True,,,False,False,,CXB1/ByJ,m,1.11,0.591,8,0.83
48937,HMDPpheno5,css,,48937,pct_GRA,granulocyte differential (GRA; percentage of total viable WBC),,%,,,complete blood count,,HMDP w/par,m,16wks,animal,,2013,,,,79,37,,,,,True,,,False,False,,CXB1/ByJ,m,18.2,4.53,8,-1.40
48943,HMDPpheno5,css,,48943,RBC,red blood cell count (RBC; units per volume x 10<sup>6</sup>),,n/&micro;L,,6,complete blood count,,HMDP w/par,m,16wks,animal,,2013,,,,83,43,,,,,True,,,False,False,,CXB1/ByJ,m,10.2,0.472,8,1.15
48949,HMDPpheno5,css,,48949,MCV,mean RBC corpuscular volume (MCV),,fL,,,complete blood count,,HMDP w/par,m,16wks,animal,,2013,,,,83,49,,,,,True,,,False,False,,CXB1/ByJ,m,39.9,0.463,8,-1.18
48955,HMDPpheno5,css,,48955,RDW,RBC corpuscular distribution width (RDW),,%,,,complete blood count,,HMDP w/par,m,16wks,animal,,2013,,,,83,55,,,,,True,,,False,False,,CXB1/ByJ,m,17.8,0.362,8,0.63
48961,HMDPpheno5,css,,48961,MCH,mean RBC corpuscular hemoglobin (MCH),,pg,,,complete blood count,,HMDP w/par,m,16wks,animal,,2013,,,,83,61,,,,,True,,,False,False,,CXB1/ByJ,m,14.6,0.380,8,-0.60
48967,HMDPpheno5,css,,48967,MCHC,mean RBC corpuscular hemoglobin concentration (MCHC),,g/dL,,,complete blood count,,HMDP w/par,m,16wks,animal,,2013,,,,83,67,,,,,True,,,False,False,,CXB1/ByJ,m,36.7,0.961,8,0.80
48973,HMDPpheno5,css,,48973,HGB,hemoglobin (HGB),,g/dL,,,complete blood count,,HMDP w/par,m,16wks,animal,,2013,,,,83,73,,,,,True,,,False,False,,CXB1/ByJ,m,14.8,0.778,8,1.07
48979,HMDPpheno5,css,,48979,HCT,hematocrit (HCT),,%,,,complete blood count,,HMDP w/par,m,16wks,animal,,2013,,,,83,79,,,,,True,,,False,False,,CXB1/ByJ,m,40.5,1.59,8,0.39
48985,HMDPpheno5,css,,48985,PLT,platelet count (PLT; units per volume x 10<sup>3</sup>),,n/&micro;L,,3,complete blood count,,HMDP w/par,m,16wks,animal,,2013,,,,83,85,,,,,True,,,False,False,,CXB1/ByJ,m,324,68.5,8,0.45
48991,HMDPpheno5,css,,48991,MPV,mean platelet volume (MPV),,fL,,,complete blood count,,HMDP w/par,m,16wks,animal,,2013,,,,83,91,,,,,True,,,False,False,,CXB1/ByJ,m,5.85,0.200,8,-0.91
50101,HMDPpheno6,css,,50101,Ala,"liver alanine (16h fast), relative abundance",,,,,metabolite quantification,,HMDP w/par,m,16wks,animal,,2014,,,,106,1,,,,,True,,,False,False,,CXB1/ByJ,m,86838357,3799401,3,1.04
50102,HMDPpheno6,css,,50102,Asn,"liver asparagine (16h fast), relative abundance",,,,,metabolite quantification,,HMDP w/par,m,16wks,animal,,2014,,,,106,2,,,,,True,,,False,False,,CXB1/ByJ,m,296604,28671,3,0.04
50103,HMDPpheno6,css,,50103,Asp,"liver aspartate (16h fast), relative abundance",,,,,metabolite quantification,,HMDP w/par,m,16wks,animal,,2014,,,,106,3,,,,,True,,,False,False,,CXB1/ByJ,m,11055623,1094601,3,-0.37
50104,HMDPpheno6,css,,50104,beta_Ala,"liver beta-alanine (16h fast), relative abundance",,,,,metabolite quantification,,HMDP w/par,m,16wks,animal,,2014,,,,106,4,,,,,True,,,False,False,,CXB1/ByJ,m,1225197,386521,3,2.11
50105,HMDPpheno6,css,,50105,acetyl_Asn,"liver N-acetylasparagine (16h fast), relative abundance",,,,,metabolite quantification,,HMDP w/par,m,16wks,animal,,2014,,,,103,5,,,,,True,,,False,False,,CXB1/ByJ,m,64338,21331,3,-0.14
50106,HMDPpheno6,css,,50106,acetyl_Ala,"liver N-acetylalanine (16h fast), relative abundance",,,,,metabolite quantification,,HMDP w/par,m,16wks,animal,,2014,,,,104,6,,,,,True,,,False,False,,CXB1/ByJ,m,25747,2661,3,0.64
50107,HMDPpheno6,css,,50107,aminobutyrate,"liver 2-aminobutyrate (16h fast), relative abundance",,,,,metabolite quantification,,HMDP w/par,m,16wks,animal,,2014,,,,106,7,,,,,True,,,False,False,,CXB1/ByJ,m,1064146,300642,3,-0.55
50108,HMDPpheno6,css,,50108,creatine,"liver creatine (16h fast), relative abundance",,,,,metabolite quantification,,HMDP w/par,m,16wks,animal,,2014,,,,106,8,,,,,True,,,False,False,,CXB1/ByJ,m,3482224,326221,3,-0.38
50109,HMDPpheno6,css,,50109,AHB,"liver 2-hydroxybutyrate (AHB) (16h fast), relative abundance",,,,,metabolite quantification,,HMDP w/par,m,16wks,animal,,2014,,,,99,9,,,,,True,,,False,False,,CXB1/ByJ,m,217700,23039,3,0.17
50110,HMDPpheno6,css,,50110,Cys,"liver cysteine (16h fast), relative abundance",,,,,metabolite quantification,,HMDP w/par,m,16wks,animal,,2014,,,,106,10,,,,,True,,,False,False,,CXB1/ByJ,m,1572332,456935,3,0.68
50111,HMDPpheno6,css,,50111,hypotaurine,"liver hypotaurine (16h fast), relative abundance",,,,,metabolite quantification,,HMDP w/par,m,16wks,animal,,2014,,,,106,11,,,,,True,,,False,False,,CXB1/ByJ,m,1005755,289503,3,-0.48
50112,HMDPpheno6,css,,50112,Met,"liver methionine (16h fast), relative abundance",,,,,metabolite quantification,,HMDP w/par,m,16wks,animal,,2014,,,,106,12,,,,,True,,,False,False,,CXB1/ByJ,m,6469249,603183,3,-0.37
50113,HMDPpheno6,css,,50113,Met_sulf,"liver methionine sulfoxide (16h fast), relative abundance",,,,,metabolite quantification,,HMDP w/par,m,16wks,animal,,2014,,,,104,13,,,,,True,,,False,False,,CXB1/ByJ,m,130479,80640,3,-0.56
50114,HMDPpheno6,css,,50114,taurine,"liver taurine (16h fast), relative abundance",,,,,metabolite quantification,,HMDP w/par,m,16wks,animal,,2014,,,,106,14,,,,,True,,,False,False,,CXB1/ByJ,m,1209229,65181,3,-0.20
50115,HMDPpheno6,css,,50115,acetyl_Met,"liver N-acetylmethionine (16h fast), relative abundance",,,,,metabolite quantification,,HMDP w/par,m,16wks,animal,,2014,,,,106,15,,,,,True,,,False,False,,CXB1/ByJ,m,29898,3351,3,0.95
50116,HMDPpheno6,css,,50116,SAH,"liver S-adenosylhomocysteine (SAH) (16h fast), relative abundance",,,,,metabolite quantification,,HMDP w/par,m,16wks,animal,,2014,,,,106,16,,,,,True,,,False,False,,CXB1/ByJ,m,54496,18669,3,1.76
50117,HMDPpheno6,css,,50117,GABA,"liver gamma-aminobutyrate (GABA) (16h fast), relative abundance",,,,,metabolite quantification,,HMDP w/par,m,16wks,animal,,2014,,,,106,17,,,,,True,,,False,False,,CXB1/ByJ,m,559398,103030,3,0.98
50118,HMDPpheno6,css,,50118,acetyl_Glu,"liver N-acetylglutamate (16h fast), relative abundance",,,,,metabolite quantification,,HMDP w/par,m,16wks,animal,,2014,,,,106,18,,,,,True,,,False,False,,CXB1/ByJ,m,105499,18251,3,-0.43
50119,HMDPpheno6,css,,50119,Gln,"liver glutamine (16h fast), relative abundance",,,,,metabolite quantification,,HMDP w/par,m,16wks,animal,,2014,,,,106,19,,,,,True,,,False,False,,CXB1/ByJ,m,12813703,996328,3,0.68
50120,HMDPpheno6,css,,50120,Glu,"liver glutamate (16h fast), relative abundance",,,,,metabolite quantification,,HMDP w/par,m,16wks,animal,,2014,,,,106,20,,,,,True,,,False,False,,CXB1/ByJ,m,5611081,972434,3,-0.06
50121,HMDPpheno6,css,,50121,CySSG,"liver cysteine-glutathione disulfide (16h fast), relative abundance",,,,,metabolite quantification,,HMDP w/par,m,16wks,animal,,2014,,,,106,21,,,,,True,,,False,False,,CXB1/ByJ,m,2611998,567516,3,0.72
50122,HMDPpheno6,css,,50122,GSH,"liver glutathione, reduced (GSH) (16h fast), relative abundance",,,,,metabolite quantification,,HMDP w/par,m,16wks,animal,,2014,,,,104,22,,,,,True,,,False,False,,CXB1/ByJ,m,157238,55934,3,-0.59
50123,HMDPpheno6,css,,50123,GSSG,"liver glutathione, oxidized (GSSG) (16h fast), relative abundance",,,,,metabolite quantification,,HMDP w/par,m,16wks,animal,,2014,,,,106,23,,,,,True,,,False,False,,CXB1/ByJ,m,13868967,985849,3,0.84
50124,HMDPpheno6,css,,50124,Me_glutathione,"liver S-methylglutathione (16h fast), relative abundance",,,,,metabolite quantification,,HMDP w/par,m,16wks,animal,,2014,,,,106,24,,,,,True,,,False,False,,CXB1/ByJ,m,236248,23594,3,0.94
50125,HMDPpheno6,css,,50125,ophthalmate,"liver ophthalmate (16h fast), relative abundance",,,,,metabolite quantification,,HMDP w/par,m,16wks,animal,,2014,,,,106,25,,,,,True,,,False,False,,CXB1/ByJ,m,448097,396715,3,-0.60
50126,HMDPpheno6,css,,50126,oxoproline,"liver 5-oxoproline (16h fast), relative abundance",,,,,metabolite quantification,,HMDP w/par,m,16wks,animal,,2014,,,,106,26,,,,,True,,,False,False,,CXB1/ByJ,m,172133,14170,3,-0.43
50127,HMDPpheno6,css,,50127,acetyl_Gly,"liver N-acetylglycine (16h fast), relative abundance",,,,,metabolite quantification,,HMDP w/par,m,16wks,animal,,2014,,,,96,27,,,,,True,,,False,False,,CXB1/ByJ,m,68912,13063,3,0.24
50128,HMDPpheno6,css,,50128,diMe_Gly,"liver dimethylglycine (16h fast), relative abundance",,,,,metabolite quantification,,HMDP w/par,m,16wks,animal,,2014,,,,96,28,,,,,True,,,False,False,,CXB1/ByJ,m,473660,183149,3,1.52
50129,HMDPpheno6,css,,50129,Gly,"liver glycine (16h fast), relative abundance",,,,,metabolite quantification,,HMDP w/par,m,16wks,animal,,2014,,,,106,29,,,,,True,,,False,False,,CXB1/ByJ,m,32002952,1833528,3,-0.34
50130,HMDPpheno6,css,,50130,homo_Ser,"liver homoserine (16h fast), relative abundance",,,,,metabolite quantification,,HMDP w/par,m,16wks,animal,,2014,,,,104,30,,,,,True,,,False,False,,CXB1/ByJ,m,48174,19513,3,-0.44
50131,HMDPpheno6,css,,50131,Ser,"liver serine (16h fast), relative abundance",,,,,metabolite quantification,,HMDP w/par,m,16wks,animal,,2014,,,,106,31,,,,,True,,,False,False,,CXB1/ByJ,m,25802551,3437592,3,-0.37
50132,HMDPpheno6,css,,50132,Thr,"liver threonine (16h fast), relative abundance",,,,,metabolite quantification,,HMDP w/par,m,16wks,animal,,2014,,,,106,32,,,,,True,,,False,False,,CXB1/ByJ,m,7820520,961050,3,-0.31
50133,HMDPpheno6,css,,50133,betaine,"liver betaine (16h fast), relative abundance",,,,,metabolite quantification,,HMDP w/par,m,16wks,animal,,2014,,,,106,33,,,,,True,,,False,False,,CXB1/ByJ,m,6363696,1521864,3,0.04
50134,HMDPpheno6,css,,50134,betaine_aldehyde,"liver betaine aldehyde (16h fast), relative abundance",,,,,metabolite quantification,,HMDP w/par,m,16wks,animal,,2014,,,,106,34,,,,,True,,,False,False,,CXB1/ByJ,m,1440569,102639,3,-0.58
50135,HMDPpheno6,css,,50135,MeC_Gly,"liver 3-methylcrotonylglycine (16h fast), relative abundance",,,,,metabolite quantification,,HMDP w/par,m,16wks,animal,,2014,,,,98,35,,,,,True,,,False,False,,CXB1/ByJ,m,28399,9363,2,-0.75
50136,HMDPpheno6,css,,50136,guanidino,"liver 4-guanidinobutanoate (16h fast), relative abundance",,,,,metabolite quantification,,HMDP w/par,m,16wks,animal,,2014,,,,94,36,,,,,True,,,False,False,,CXB1/ByJ,m,42110,4189,3,-0.24
50137,HMDPpheno6,css,,50137,MeLAA,"liver 1-methylimidazoleacetate (16h fast), relative abundance",,,,,metabolite quantification,,HMDP w/par,m,16wks,animal,,2014,,,,91,37,,,,,True,,,False,False,,CXB1/ByJ,m,66375,14434,3,-0.05
50138,HMDPpheno6,css,,50138,His,"liver histidine (16h fast), relative abundance",,,,,metabolite quantification,,HMDP w/par,m,16wks,animal,,2014,,,,106,38,,,,,True,,,False,False,,CXB1/ByJ,m,347827,81831,3,0.21
50139,HMDPpheno6,css,,50139,glutarate,"liver glutarate (pentanedioate) (16h fast), relative abundance",,,,,metabolite quantification,,HMDP w/par,m,16wks,animal,,2014,,,,100,39,,,,,True,,,False,False,,CXB1/ByJ,m,26596,17963,2,-0.19
50140,HMDPpheno6,css,,50140,acetyl_Lys,"liver N2-acetyllysine (16h fast), relative abundance",,,,,metabolite quantification,,HMDP w/par,m,16wks,animal,,2014,,,,105,40,,,,,True,,,False,False,,CXB1/ByJ,m,77747,13779,3,-0.25
50141,HMDPpheno6,css,,50141,aminoadipate,"liver 2-aminoadipate (16h fast), relative abundance",,,,,metabolite quantification,,HMDP w/par,m,16wks,animal,,2014,,,,98,41,,,,,True,,,False,False,,CXB1/ByJ,m,208646,115221,3,-0.24
50142,HMDPpheno6,css,,50142,GO_carnitine,"liver glutaroyl carnitine (16h fast), relative abundance",,,,,metabolite quantification,,HMDP w/par,m,16wks,animal,,2014,,,,106,42,,,,,True,,,False,False,,CXB1/ByJ,m,651177,158087,3,-0.05
50143,HMDPpheno6,css,,50143,Lys,"liver lysine (16h fast), relative abundance",,,,,metabolite quantification,,HMDP w/par,m,16wks,animal,,2014,,,,106,43,,,,,True,,,False,False,,CXB1/ByJ,m,2630886,185563,3,-0.43
50144,HMDPpheno6,css,,50144,pipecolate,"liver pipecolate (16h fast), relative abundance",,,,,metabolite quantification,,HMDP w/par,m,16wks,animal,,2014,,,,106,44,,,,,True,,,False,False,,CXB1/ByJ,m,337510,71848,3,-0.41
50145,HMDPpheno6,css,,50145,Phe,"liver phenylalanine (16h fast), relative abundance",,,,,metabolite quantification,,HMDP w/par,m,16wks,animal,,2014,,,,106,45,,,,,True,,,False,False,,CXB1/ByJ,m,33656745,4020081,3,-0.16
50146,HMDPpheno6,css,,50146,Tyr,"liver tyrosine (16h fast), relative abundance",,,,,metabolite quantification,,HMDP w/par,m,16wks,animal,,2014,,,,106,46,,,,,True,,,False,False,,CXB1/ByJ,m,9305856,2425556,3,-0.12
50147,HMDPpheno6,css,,50147,HP_lactate,"liver 3-(4-hydroxyphenyl)lactate (16h fast), relative abundance",,,,,metabolite quantification,,HMDP w/par,m,16wks,animal,,2014,,,,106,47,,,,,True,,,False,False,,CXB1/ByJ,m,29107,11210,3,0.45
50148,HMDPpheno6,css,,50148,PA_Gly,"liver phenylacetylglycine (16h fast), relative abundance",,,,,metabolite quantification,,HMDP w/par,m,16wks,animal,,2014,,,,105,48,,,,,True,,,False,False,,CXB1/ByJ,m,32341,24083,3,0.88
50149,HMDPpheno6,css,,50149,phenol_sulfate,"liver phenol sulfate (16h fast), relative abundance",,,,,metabolite quantification,,HMDP w/par,m,16wks,animal,,2014,,,,103,49,,,,,True,,,False,False,,CXB1/ByJ,m,19418,8821,3,-0.57
50150,HMDPpheno6,css,,50150,MTA,"liver 5-methylthioadenosine (MTA) (16h fast), relative abundance",,,,,metabolite quantification,,HMDP w/par,m,16wks,animal,,2014,,,,106,50,,,,,True,,,False,False,,CXB1/ByJ,m,51589,6774,3,-0.19
50151,HMDPpheno6,css,,50151,spermidine,"liver spermidine (16h fast), relative abundance",,,,,metabolite quantification,,HMDP w/par,m,16wks,animal,,2014,,,,106,51,,,,,True,,,False,False,,CXB1/ByJ,m,249662,116517,3,-0.51
50152,HMDPpheno6,css,,50152,anthranilate,"liver anthranilate (16h fast), relative abundance",,,,,metabolite quantification,,HMDP w/par,m,16wks,animal,,2014,,,,105,52,,,,,True,,,False,False,,CXB1/ByJ,m,74960,28531,3,-0.04
50153,HMDPpheno6,css,,50153,glycosyl_Trp,"liver C-glycosyltryptophan (16h fast), relative abundance",,,,,metabolite quantification,,HMDP w/par,m,16wks,animal,,2014,,,,106,53,,,,,True,,,False,False,,CXB1/ByJ,m,163198,21320,3,0.12
50154,HMDPpheno6,css,,50154,kynurenine,"liver kynurenine (16h fast), relative abundance",,,,,metabolite quantification,,HMDP w/par,m,16wks,animal,,2014,,,,106,54,,,,,True,,,False,False,,CXB1/ByJ,m,247514,34658,3,-0.07
50155,HMDPpheno6,css,,50155,Trp,"liver tryptophan (16h fast), relative abundance",,,,,metabolite quantification,,HMDP w/par,m,16wks,animal,,2014,,,,106,55,,,,,True,,,False,False,,CXB1/ByJ,m,6715333,1147414,3,-0.07
50156,HMDPpheno6,css,,50156,kynurenate,"liver kynurenate (16h fast), relative abundance",,,,,metabolite quantification,,HMDP w/par,m,16wks,animal,,2014,,,,105,56,,,,,True,,,False,False,,CXB1/ByJ,m,10780,3503,3,-0.75
50157,HMDPpheno6,css,,50157,hydroxy_Pro,"liver trans-4-hydroxyproline (16h fast), relative abundance",,,,,metabolite quantification,,HMDP w/par,m,16wks,animal,,2014,,,,103,57,,,,,True,,,False,False,,CXB1/ByJ,m,159559,67495,3,-0.19
50158,HMDPpheno6,css,,50158,ornithine,"liver ornithine (16h fast), relative abundance",,,,,metabolite quantification,,HMDP w/par,m,16wks,animal,,2014,,,,106,58,,,,,True,,,False,False,,CXB1/ByJ,m,4644304,1092113,3,-0.15
50159,HMDPpheno6,css,,50159,urea,"liver urea (16h fast), relative abundance",,,,,metabolite quantification,,HMDP w/par,m,16wks,animal,,2014,,,,106,59,,,,,True,,,False,False,,CXB1/ByJ,m,2111121,543231,3,0.17
50160,HMDPpheno6,css,,50160,acetylornithine,"liver N-acetylornithine (16h fast), relative abundance",,,,,metabolite quantification,,HMDP w/par,m,16wks,animal,,2014,,,,103,60,,,,,True,,,False,False,,CXB1/ByJ,m,53480,7343,3,-0.94
50161,HMDPpheno6,css,,50161,aminovalerate,"liver 5-aminovalerate (16h fast), relative abundance",,,,,metabolite quantification,,HMDP w/par,m,16wks,animal,,2014,,,,106,61,,,,,True,,,False,False,,CXB1/ByJ,m,551674,124836,3,-0.46
50162,HMDPpheno6,css,,50162,citrulline,"liver citrulline (16h fast), relative abundance",,,,,metabolite quantification,,HMDP w/par,m,16wks,animal,,2014,,,,106,62,,,,,True,,,False,False,,CXB1/ByJ,m,243943,88299,3,-0.35
50163,HMDPpheno6,css,,50163,homostachydrine,"liver homostachydrine (16h fast), relative abundance",,,,,metabolite quantification,,HMDP w/par,m,16wks,animal,,2014,,,,105,63,,,,,True,,,False,False,,CXB1/ByJ,m,117880,46658,3,-0.66
50164,HMDPpheno6,css,,50164,Pro,"liver proline (16h fast), relative abundance",,,,,metabolite quantification,,HMDP w/par,m,16wks,animal,,2014,,,,106,64,,,,,True,,,False,False,,CXB1/ByJ,m,8540673,241921,3,-0.02
50165,HMDPpheno6,css,,50165,SMDA_ADMA,"liver dimethylarginine (SDMA + ADMA) (16h fast), relative abundance",,,,,metabolite quantification,,HMDP w/par,m,16wks,animal,,2014,,,,106,65,,,,,True,,,False,False,,CXB1/ByJ,m,983045,73339,3,-0.03
50166,HMDPpheno6,css,,50166,stachydrine,"liver stachydrine (16h fast), relative abundance",,,,,metabolite quantification,,HMDP w/par,m,16wks,animal,,2014,,,,104,66,,,,,True,,,False,False,,CXB1/ByJ,m,180977,20616,3,-0.28
50167,HMDPpheno6,css,,50167,HV_carnitine,"liver hydroxyisovaleroyl carnitine (16h fast), relative abundance",,,,,metabolite quantification,,HMDP w/par,m,16wks,animal,,2014,,,,104,67,,,,,True,,,False,False,,CXB1/ByJ,m,313337,98628,3,0.36
50168,HMDPpheno6,css,,50168,IB_carnitine,"liver isobutyrylcarnitine (16h fast), relative abundance",,,,,metabolite quantification,,HMDP w/par,m,16wks,animal,,2014,,,,106,68,,,,,True,,,False,False,,CXB1/ByJ,m,59789,10240,3,-1.11
50169,HMDPpheno6,css,,50169,Ile,"liver isoleucine (16h fast), relative abundance",,,,,metabolite quantification,,HMDP w/par,m,16wks,animal,,2014,,,,106,69,,,,,True,,,False,False,,CXB1/ByJ,m,19418323,3108171,3,0.10
50170,HMDPpheno6,css,,50170,IV_carnitine,"liver isovalerylcarnitine (16h fast), relative abundance",,,,,metabolite quantification,,HMDP w/par,m,16wks,animal,,2014,,,,106,70,,,,,True,,,False,False,,CXB1/ByJ,m,70057,24488,3,-0.89
50171,HMDPpheno6,css,,50171,IV_Gly,"liver isovalerylglycine (16h fast), relative abundance",,,,,metabolite quantification,,HMDP w/par,m,16wks,animal,,2014,,,,106,71,,,,,True,,,False,False,,CXB1/ByJ,m,97636,39069,3,-0.58
50172,HMDPpheno6,css,,50172,Leu,"liver leucine (16h fast), relative abundance",,,,,metabolite quantification,,HMDP w/par,m,16wks,animal,,2014,,,,106,72,,,,,True,,,False,False,,CXB1/ByJ,m,38154029,3405760,3,-0.21
50173,HMDPpheno6,css,,50173,MeB_carnitine,"liver 2-methylbutyroylcarnitine (16h fast), relative abundance",,,,,metabolite quantification,,HMDP w/par,m,16wks,animal,,2014,,,,105,73,,,,,True,,,False,False,,CXB1/ByJ,m,91879,34550,3,-0.98
50174,HMDPpheno6,css,,50174,MeG_carnitine,"liver methylglutaroylcarnitine (16h fast), relative abundance",,,,,metabolite quantification,,HMDP w/par,m,16wks,animal,,2014,,,,106,74,,,,,True,,,False,False,,CXB1/ByJ,m,1874224,1718598,3,0.12
50175,HMDPpheno6,css,,50175,tigloyl_Gly,"liver tigloylglycine (16h fast), relative abundance",,,,,metabolite quantification,,HMDP w/par,m,16wks,animal,,2014,,,,92,75,,,,,True,,,False,False,,CXB1/ByJ,m,48721,7851,3,0.68
50176,HMDPpheno6,css,,50176,tiglyl_carnitine,"liver tiglyl carnitine (16h fast), relative abundance",,,,,metabolite quantification,,HMDP w/par,m,16wks,animal,,2014,,,,106,76,,,,,True,,,False,False,,CXB1/ByJ,m,89337,17894,3,-1.17
50177,HMDPpheno6,css,,50177,Val,"liver valine (16h fast), relative abundance",,,,,metabolite quantification,,HMDP w/par,m,16wks,animal,,2014,,,,106,77,,,,,True,,,False,False,,CXB1/ByJ,m,19152491,2220708,3,-0.42
50178,HMDPpheno6,css,,50178,MMA,"liver methylmalonate (MMA) (16h fast), relative abundance",,,,,metabolite quantification,,HMDP w/par,m,16wks,animal,,2014,,,,106,78,,,,,True,,,False,False,,CXB1/ByJ,m,20702,2764,3,-0.34
50201,HMDPpheno7,css,,50201,erythronate,"liver erythronate (16h fast), relative abundance",,,,,metabolite quantification,,HMDP,m,16wks,animal,,2014,,,,102,1,,,,,True,,,False,False,,CXB1/ByJ,m,44477,8237,3,1.41
50202,HMDPpheno7,css,,50202,glucosamine,"liver glucosamine (16h fast), relative abundance",,,,,metabolite quantification,,HMDP,m,16wks,animal,,2014,,,,93,2,,,,,True,,,False,False,,CXB1/ByJ,m,111734,15926,2,-0.58
50203,HMDPpheno7,css,,50203,erythrose,"liver erythrose (16h fast), relative abundance",,,,,metabolite quantification,,HMDP,m,16wks,animal,,2014,,,,106,3,,,,,True,,,False,False,,CXB1/ByJ,m,250290,61627,3,0.37
50204,HMDPpheno7,css,,50204,fructose,"liver fructose (16h fast), relative abundance",,,,,metabolite quantification,,HMDP,m,16wks,animal,,2014,,,,106,4,,,,,True,,,False,False,,CXB1/ByJ,m,1556069,158256,3,-0.04
50205,HMDPpheno7,css,,50205,maltose,"liver maltose (16h fast), relative abundance",,,,,metabolite quantification,,HMDP,m,16wks,animal,,2014,,,,94,5,,,,,True,,,False,False,,CXB1/ByJ,m,11891323,14113196,3,-0.26
50206,HMDPpheno7,css,,50206,mannose,"liver mannose (16h fast), relative abundance",,,,,metabolite quantification,,HMDP,m,16wks,animal,,2014,,,,106,6,,,,,True,,,False,False,,CXB1/ByJ,m,17636368,2447245,3,-0.15
50207,HMDPpheno7,css,,50207,sorbitol,"liver sorbitol (16h fast), relative abundance",,,,,metabolite quantification,,HMDP,m,16wks,animal,,2014,,,,106,7,,,,,True,,,False,False,,CXB1/ByJ,m,437981,135206,3,0.32
50208,HMDPpheno7,css,,50208,maltotetraose,"liver maltotetraose (16h fast), relative abundance",,,,,metabolite quantification,,HMDP,m,16wks,animal,,2014,,,,100,8,,,,,True,,,False,False,,CXB1/ByJ,m,89606,29177,3,-0.23