chr,bp38,rs,observed,dbsnp142annot,requested,"C57BL/6J::7","129S1/SvImJ::3","A/J::4","CAST/EiJ::2","NOD/ShiLtJ::13","NZO/HlLtJ::122","PWK/PhJ::217","WSB/EiJ::42","CC001/Unc::1601","CC002/Unc::1602","CC003/Unc::1603","CC004/TauUnc::1604","CC005/TauUnc::1605","CC006/TauUnc::1606","CC007/Unc::1607","CC008/GeniUnc::1608","CC009/Unc::1609","CC010/GeniUnc::1610","CC011/Unc::1611","CC012/GeniUnc::1612","CC013/GeniUnc::1613","CC015/Unc::1615","CC016/GeniUnc::1616","CC017/Unc::1617","CC018/Unc::1618","CC019/TauUnc::1619","CC020/GeniUnc::1620","CC021/Unc::1621","CC022/GeniUnc::1622","CC023/GeniUnc::1623","CC024/GeniUnc::1624","CC025/GeniUnc::1625","CC026/GeniUnc::1626","CC027/GeniUnc::1627","CC028/GeniUnc::1628","CC029/Unc::1629","CC030/GeniUnc::1630","CC031/GeniUnc::1631","CC032/GeniUnc::1632","CC033/GeniUnc::1633","CC034/Unc::1534","CC035/Unc::1635","CC036/Unc::1636","CC037/TauUnc::1637","CC038/GeniUnc::1638","CC039/Unc::1639","CC040/TauUnc::1640","CC041/TauUnc::1641","CC042/GeniUnc::1642","CC043/GeniUnc::1643","CC044/Unc::1644","CC045/GeniUnc::1645","CC046/Unc::1646","CC047/Unc::1547","CC049/TauUnc::1649","CC050/Unc::1650","CC051/TauUnc::1651","CC052/GeniUnc::1652","CC053/Unc::1653","CC055/TauUnc::1655","CC056/GeniUnc::1656","CC057/Unc::1657","CC058/Unc::1658","CC059/TauUnc::1659","CC060/Unc::1660","CC061/GeniUnc::1678","CC062/Unc::1662","CC063/Unc::1663","CC065/Unc::1665","CC068/TauUnc::1668","CC070/TauUnc::1670","CC071/TauUnc::1671","CC072/TauUnc::1672","CC073/Unc::1573","CC074/Unc::1674","CC075/Unc::1675","CC076/Unc::1590",
19,3178246,"rs240720258","C/G","I:1700030N03Rik","19:all",G,G,G,C,G,G,G,G,G,G,G,G,G,G,G,G,G,G,G,G,G,G,G,G,G,G,G,G,G,G,G,G,G,G,G,G,G,G,G,G,G,G,G,G,G,G,G,G,G,G,G,G,G,G,G,G,G,G,G,G,G,G,G,G,G,G,G,G,G,G,G,G,G,G,G,G,G,
19,3212431,,,"","19:all",T,,T,T,,,,T,T,T,T,T,T,T,T,T,T,T,T,T,T,T,T,T,T,T,T,T,T,T,T,T,T,T,T,T,T,T,T,T,T,T,T,T,T,T,T,T,T,T,T,T,T,T,T,T,T,T,T,T,T,T,T,T,T,T,T,T,T,T,T,T,T,T,T,T,T,
19,3230358,"rs251177976","C/T","","19:all",T,T,T,T,T,T,C,C,T,C,C,C,T,C,T,T,T,T,T,T,T,C,T,T,T,T,T,T,T,T,T,C,T,T,T,T,T,T,T,C,C,C,T,T,T,T,C,C,T,T,T,C,T,T,C,C,T,T,C,C,C,T,T,T,T,T,C,T,C,T,T,T,T,T,C,T,T,
19,3240760,"rs37881130","C/T","","19:all",C,,C,T,,,T,T,C,T,T,,C,T,C,C,T,C,C,C,C,T,C,C,C,T,C,C,C,C,C,T,C,C,C,C,C,T,C,T,T,T,C,C,C,C,T,T,C,T,C,T,C,C,T,T,C,T,T,T,T,T,C,C,C,C,T,C,T,C,C,T,C,T,T,C,C,
19,3263752,"rs39372196","A/G","I:Ighmbp2","19:all",G,G,G,G,G,G,G,A,G,A,A,,G,A,G,G,G,G,,G,G,,G,G,G,G,G,G,G,G,G,A,G,G,G,G,G,G,G,G,G,G,G,G,G,G,A,A,G,G,G,G,G,G,G,A,G,G,A,G,G,G,G,G,G,G,,G,A,G,G,G,G,G,G,G,G,
19,3336553,"rs37597668","A/G","I:Cpt1a","19:all",A,A,A,G,A,A,G,G,A,G,G,G,A,G,A,A,G,A,A,A,A,G,A,A,A,G,A,A,A,A,A,G,A,A,A,A,A,G,A,G,G,G,A,A,A,A,G,G,A,G,A,G,A,A,G,G,A,G,G,G,G,G,A,A,A,A,G,A,G,A,A,G,A,G,G,A,A,
19,3339062,"rs241520453","A/G","I:Cpt1a","19:all",G,G,G,G,G,G,A,G,G,G,G,G,G,G,G,G,G,G,H,G,G,G,G,G,G,G,G,G,G,G,G,G,G,G,G,G,G,G,G,A,A,A,G,G,G,G,G,G,G,G,G,A,G,G,A,G,G,G,G,A,A,G,G,G,G,G,G,G,G,G,G,G,G,G,A,G,G,
19,3371529,"rs36852390","C/T","I:Cpt1a","19:all",C,C,C,T,C,C,C,T,C,T,T,T,C,T,C,C,T,C,C,C,C,T,C,C,C,T,C,C,C,C,C,T,C,C,C,C,C,T,C,C,C,C,C,C,C,C,T,T,C,T,C,C,C,C,C,T,C,T,T,C,C,T,C,C,C,C,T,C,T,C,C,T,C,T,C,C,C,
19,3399965,"rs36253098","C/T","I:Mtl5","19:all",T,T,T,T,T,T,C,C,T,C,C,C,T,C,T,T,T,T,T,T,T,C,T,T,T,T,T,T,T,T,T,C,T,T,T,T,T,T,T,C,C,C,T,T,T,T,C,C,T,T,T,C,T,T,C,C,T,T,C,C,C,T,T,T,T,T,C,T,C,T,T,T,T,T,C,T,T,
19,3402767,"rs36927601","A/G","I:Mtl5","19:all",G,G,A,A,A,G,A,G,A,G,G,G,A,G,G,G,A,A,G,G,G,G,G,G,G,A,A,G,G,G,G,G,G,G,G,A,A,A,G,A,A,A,G,A,G,A,G,G,G,A,A,G,A,G,A,G,G,A,G,A,A,A,A,G,G,A,G,G,G,G,A,A,G,A,A,G,G,
19,3403302,"rs31128510","A/G","I:Mtl5","19:all",A,A,G,G,G,A,G,G,G,G,G,G,G,G,A,A,G,G,A,A,A,G,A,A,A,G,G,A,A,A,A,G,A,A,A,G,G,G,A,G,G,G,A,G,A,G,G,G,A,G,G,A,G,A,G,G,A,G,G,G,G,G,G,A,A,A,G,A,G,A,G,G,A,G,G,A,A,
19,3408577,"rs31096456","A/G","","19:all",G,G,A,A,A,G,G,A,A,A,A,A,A,A,G,G,A,A,G,G,G,A,G,G,G,A,A,G,G,G,G,A,G,G,G,A,A,A,G,G,G,G,G,A,G,A,A,A,G,A,A,G,A,G,G,A,G,A,A,G,G,A,A,G,G,G,A,G,A,G,A,A,G,A,G,G,G,
19,3480987,"rs37394045","C/T","I:Ppp6r3 NC:LOC105246835","19:all",,,,,,,,,C,C,C,C,C,C,C,C,C,C,C,C,C,C,C,C,C,C,C,C,C,C,C,C,C,C,C,C,C,C,C,C,C,C,C,C,C,C,C,C,C,C,C,C,C,C,C,C,C,C,C,C,C,C,C,C,C,C,C,C,C,C,C,C,C,C,C,C,C,
19,3490564,"rs30503185","C/G","I:Ppp6r3","19:all",C,G,G,G,G,G,G,G,G,G,G,G,G,G,C,C,G,G,G,G,G,G,G,G,G,G,G,C,G,G,G,G,G,G,G,G,G,G,G,G,G,G,G,G,C,G,G,G,G,G,G,C,G,G,G,G,G,G,G,G,G,G,G,G,C,G,G,G,G,C,G,G,C,G,G,G,C,
19,3526833,"rs37320753","A/G","Cs:Ppp6r3:D:32","19:all",A,A,A,G,A,A,G,G,A,G,G,G,A,G,A,A,G,A,A,A,A,G,A,A,A,G,A,A,A,A,A,G,A,A,A,A,A,G,A,G,G,G,A,A,A,A,G,G,A,G,A,A,A,A,G,G,A,G,G,G,G,G,A,A,A,A,G,A,G,A,A,G,A,G,G,A,A,
19,3613130,"rs31252514","C/T","I:Lrp5","19:all",C,C,T,T,T,C,C,T,T,T,T,T,T,T,C,C,T,T,C,C,C,T,C,C,C,C,T,C,C,C,C,T,C,C,C,T,T,T,C,C,C,C,C,T,C,T,T,T,C,T,T,C,T,C,C,T,C,T,T,C,C,T,T,C,C,C,T,C,T,C,T,T,C,T,C,C,C,
19,3615896,"rs30512578","A/G","I:Lrp5","19:all",A,A,G,G,G,A,G,G,G,G,G,G,G,G,A,A,G,G,A,A,A,G,A,A,A,A,G,A,A,A,A,G,A,A,A,G,G,G,A,G,G,G,A,G,A,G,G,G,A,G,G,A,G,A,G,G,A,G,G,G,G,G,G,A,A,A,G,A,G,A,G,G,A,G,G,A,A,
19,3628802,"rs6233472","C/T","I:Lrp5","19:all",A,A,A,A,A,A,G,A,A,A,A,A,A,A,A,A,A,A,A,A,A,A,A,A,A,A,A,A,A,A,A,A,A,A,A,A,A,A,A,G,G,G,A,A,A,A,A,A,A,A,A,A,A,A,G,A,A,A,A,G,G,A,A,A,A,A,A,A,A,A,A,A,A,A,G,A,A,
19,3637651,"rs30427350","C/T","I:Lrp5","19:all",C,C,T,T,T,C,C,T,T,T,T,H,T,T,C,C,T,,,C,C,T,C,C,C,C,T,C,C,C,C,T,C,C,C,T,T,T,C,C,C,C,C,T,C,T,T,T,C,T,T,C,T,C,C,T,C,T,T,C,C,T,T,C,C,C,T,C,T,C,T,T,C,T,C,C,C,
19,3638737,"rs30899563","A/C","I:Lrp5","19:all",A,A,C,C,C,A,C,C,C,C,C,C,C,C,A,A,C,C,A,A,,C,A,A,A,A,C,A,A,A,A,C,A,A,A,C,C,C,A,C,C,C,A,C,,C,C,C,,C,C,A,C,A,C,C,A,C,C,C,C,C,C,A,A,A,C,A,C,A,C,C,A,C,C,A,A,
19,3639183,"rs30417670","C/T","I:Lrp5","19:all",T,T,C,C,C,T,T,C,C,C,C,C,C,C,T,T,C,C,T,T,T,C,T,T,T,T,C,T,T,T,T,C,T,T,T,C,C,C,T,,,H,T,C,T,C,C,C,T,C,C,T,C,T,,C,T,C,C,,,C,C,T,T,T,C,T,C,T,C,C,T,C,,T,T,
19,3641344,"rs37202457","C/T","I:Lrp5","19:all",C,C,C,T,C,C,C,T,C,T,T,T,C,T,C,C,T,C,C,C,C,T,C,C,C,C,C,C,C,C,C,T,C,C,C,C,C,T,C,C,C,C,C,C,C,C,T,T,C,T,C,C,C,C,C,T,C,T,T,C,C,T,C,C,C,C,T,C,T,C,C,T,C,T,C,C,C,
19,3649391,"rs244344427","A/C","I:Lrp5","19:all",A,A,A,C,A,A,C,C,A,A,A,A,H,A,A,A,A,A,A,A,H,A,,,,,A,,,A,,,,,,,,,,,,A,,,,,,,,,,,,,,,,,A,,,,,,,,,,,,,,,A,A,A,,
19,3708030,"rs37430296","C/T","I:Gm36608","19:all",C,C,C,T,C,C,C,C,C,C,C,C,C,C,C,C,T,C,C,C,C,C,C,C,C,C,C,C,C,C,C,C,C,C,C,C,C,T,C,C,C,C,C,C,C,C,C,C,C,T,C,C,C,C,C,C,C,T,C,C,C,T,C,C,C,C,C,C,C,C,C,T,C,T,C,C,C,
19,3744746,"rs37494735","A/C","","19:all",C,C,C,A,C,C,C,A,C,A,A,,C,A,C,C,,C,C,C,C,A,C,C,C,C,C,C,C,C,C,A,C,C,C,C,C,A,C,C,C,C,C,C,C,C,A,A,C,A,C,C,C,C,C,A,C,A,A,C,C,A,C,C,C,C,A,C,A,C,C,A,C,A,C,C,C,
19,3749667,"rs257500823","C/T","","19:all",T,T,T,C,T,T,C,C,T,T,T,T,T,T,T,T,T,T,T,T,T,T,T,T,T,T,T,T,T,T,T,T,T,T,T,T,T,T,T,T,T,T,T,T,T,T,T,T,T,T,T,T,T,T,T,T,T,T,T,T,T,T,T,T,T,T,T,T,T,T,T,T,T,T,T,T,T,
19,3785517,"rs36851501","C/T","I:Suv420h1","19:all",C,C,C,C,C,C,C,C,C,C,C,C,C,C,C,C,C,C,C,C,C,C,C,C,C,C,C,C,C,C,C,C,C,C,C,C,C,C,C,C,C,C,C,C,C,C,C,C,C,C,C,C,C,C,C,C,C,C,C,C,C,C,C,C,C,C,C,C,C,C,C,C,C,C,C,C,C,
19,3799815,"rs258171810","G/T","I:Suv420h1","19:all",G,G,G,T,G,G,T,T,G,T,T,T,G,T,G,G,T,G,G,G,G,T,G,G,G,G,G,G,G,G,G,T,G,G,G,G,G,T,G,T,T,T,G,G,G,G,T,T,G,T,G,G,G,G,T,T,G,T,T,T,T,T,G,G,G,G,T,G,T,G,G,T,G,T,T,G,G,
19,3858113,"rs244428125","C/T","I:Chka","19:all",T,T,T,C,T,T,T,C,T,C,C,H,T,C,T,,C,,,T,T,C,T,T,T,T,T,T,T,T,T,C,T,T,T,T,T,C,T,,,,T,T,T,T,C,C,T,C,T,T,,T,,C,T,C,C,,,C,T,T,T,T,C,T,C,T,,C,T,C,T,T,T,
19,3861376,"rs247289276","A/G","I:Chka","19:all",G,G,G,A,G,G,A,A,G,H,H,H,G,H,G,G,H,G,G,G,G,H,G,G,G,G,G,G,G,G,G,H,G,G,G,G,G,H,G,H,H,H,G,G,G,G,H,H,G,H,G,G,G,G,,H,G,H,H,H,H,H,G,G,G,G,H,G,H,G,G,H,G,H,H,G,G,
19,3890631,"rs37990657","A/C","I:Chka","19:all",C,C,A,C,A,C,C,C,A,C,C,C,A,C,C,C,C,A,C,C,C,C,C,C,C,C,A,C,C,C,C,C,C,C,C,A,A,C,C,C,C,C,C,A,C,A,C,C,,,A,C,A,C,,C,C,C,C,C,C,C,A,C,C,C,C,C,,C,A,C,C,C,C,C,C,
19,3948421,"rs36446418","C/T","I:Unc93b1","19:all",C,C,C,T,C,C,C,T,C,T,T,,C,T,C,C,T,C,C,C,C,T,C,C,C,C,C,C,C,C,C,T,C,C,C,C,C,T,C,C,C,C,C,C,C,C,T,T,C,T,C,C,C,C,C,T,C,T,T,C,C,T,C,C,C,C,T,C,T,C,C,T,C,T,C,C,C,
19,3969586,"rs36559829","A/C","I:Aldh3b3 I:1700055N04Rik","19:all",A,A,A,A,A,A,C,A,A,A,A,A,A,A,A,A,A,A,A,A,A,A,A,A,A,A,A,A,A,A,A,A,A,A,A,A,A,A,A,C,C,C,A,A,A,A,A,A,A,A,A,A,A,A,C,A,A,A,A,C,C,A,A,A,A,A,A,A,A,A,A,A,A,A,C,A,A,
19,4019497,"rs36321371","C/T","","19:all",C,C,C,T,C,C,T,T,C,T,T,T,C,T,C,C,T,C,C,C,C,T,C,C,C,C,C,C,C,C,C,T,C,C,C,C,C,T,C,T,T,T,C,C,C,C,T,T,C,T,C,C,C,C,T,T,C,T,T,T,T,T,C,C,C,C,T,C,T,C,C,T,C,T,T,C,C,
19,4025502,"rs36495032","C/T","","19:all",C,C,C,T,C,C,C,C,C,C,C,C,C,C,C,C,T,C,C,C,C,C,C,C,C,C,C,C,C,C,C,C,C,C,C,C,C,T,C,C,C,C,C,C,C,C,C,C,C,T,C,C,C,C,C,C,C,T,C,C,C,T,C,C,C,C,C,C,C,C,C,T,C,T,C,C,C,
19,4049915,"rs38108493","C/T","","19:all",C,C,C,C,C,C,T,C,C,C,C,C,,,C,C,C,C,H,C,C,C,C,C,C,C,C,C,C,C,C,C,C,C,C,C,C,C,C,T,T,T,C,C,C,C,C,C,C,C,C,C,C,C,,C,C,C,C,T,T,C,C,C,C,C,C,C,,C,C,C,C,C,T,C,C,
19,4052841,"rs36248464","A/G","","19:all",G,G,G,G,G,G,G,G,G,G,G,G,G,G,G,G,G,G,G,G,G,G,G,G,G,G,G,G,G,G,G,G,G,G,G,G,G,G,G,G,G,G,G,G,G,G,G,G,G,G,G,G,G,G,G,G,G,G,G,G,G,G,G,G,G,G,G,G,G,G,G,G,G,G,G,G,G,
19,4057900,"rs37209065","A/G","","19:all",A,A,A,G,A,A,G,A,A,A,A,A,A,A,A,A,G,A,A,A,A,A,A,A,A,A,A,A,A,A,A,A,A,A,A,A,A,G,A,G,G,G,A,A,A,A,A,A,A,G,A,A,A,A,G,A,A,G,A,G,G,G,A,A,A,A,A,A,A,A,A,G,A,G,G,A,A,
19,4063605,,,"","19:all",,,,,,,,,T,T,T,T,T,T,T,T,T,T,T,T,T,T,,,,,T,,,T,,,,,,,,,,,,T,,,,,,,,,,,,,,,,T,T,,,,,,,,,,,,,,,T,T,T,,
19,4098846,"rs235232140","A/G","","19:all",A,A,A,G,A,A,A,A,A,,A,,A,,,A,G,A,A,A,,A,A,A,A,A,A,A,A,A,A,A,A,A,A,A,A,G,A,A,A,A,A,A,A,,A,A,A,G,A,A,A,A,,A,A,G,A,A,,G,A,,A,A,A,A,,A,A,,A,G,A,A,A,
19,4166115,"rs36743108","A/G","","19:all",G,G,G,A,G,G,A,A,G,A,A,A,H,A,G,G,A,G,,G,G,A,G,G,G,G,G,G,G,G,G,A,G,G,G,G,G,A,G,A,A,A,G,G,G,G,A,A,,A,G,G,G,G,A,A,G,A,A,A,A,A,G,,G,G,A,G,,G,G,A,G,A,A,G,G,
19,4197708,"rs37119746","C/T","","19:all",C,C,C,T,C,C,T,C,C,C,C,C,C,C,C,C,T,C,C,C,C,C,C,C,C,C,C,C,C,C,C,C,C,C,C,C,C,T,C,T,T,T,C,C,C,C,C,C,C,T,C,C,C,C,T,C,C,T,C,T,T,T,C,C,C,C,C,C,C,C,C,T,C,T,T,C,C,
19,4199559,"rs30371185","A/G","","19:all",A,A,G,A,G,A,A,A,G,A,A,A,G,A,A,A,A,G,A,A,A,A,A,A,A,A,G,A,A,A,A,A,A,A,A,G,G,A,A,A,A,A,A,G,A,G,A,A,A,A,G,A,G,A,A,A,A,A,A,A,A,A,G,A,A,A,A,A,A,A,G,A,A,A,A,A,A,
19,4201148,"rs264890643","A/G","","19:all",A,A,A,G,A,A,G,A,A,A,A,A,A,A,A,A,G,A,A,A,A,A,A,A,A,A,A,A,A,A,A,A,A,A,A,A,A,G,A,G,G,G,A,A,A,A,A,A,A,G,A,A,A,A,G,A,A,G,A,G,G,G,A,A,A,A,A,A,A,A,A,G,A,G,G,A,A,
19,4206543,"rs36589660","A/G","","19:all",G,G,G,A,G,G,A,G,G,G,G,G,G,G,G,G,A,G,G,G,G,G,G,G,G,G,G,G,G,G,G,G,G,G,G,G,G,A,G,A,A,A,G,G,G,G,G,G,G,A,G,G,G,G,A,G,G,A,G,A,A,A,G,G,G,G,G,G,G,G,G,A,G,A,A,G,G,
19,4235196,"rs36247798","C/T","","19:all",C,C,C,T,C,C,T,C,C,C,C,C,C,C,C,C,T,C,C,C,C,C,C,C,C,C,C,C,C,C,C,C,C,C,C,C,C,T,C,T,T,T,C,C,C,C,C,C,C,T,C,C,C,C,T,C,C,T,C,T,T,T,C,C,C,C,C,C,C,C,C,T,C,T,T,C,C,
19,4266345,"rs241844123","C/T","I:Ssh3","19:all",T,T,T,C,T,T,C,T,T,T,T,,,,,,C,,,,,,T,T,T,T,T,T,T,,T,T,T,T,T,T,T,C,T,C,C,C,,T,,,T,T,T,C,T,,T,T,C,T,T,C,T,C,C,C,T,T,T,T,,T,,T,T,C,T,C,C,T,T,
19,4266847,"rs256046506","C/T","I:Ssh3","19:all",T,T,T,C,T,T,C,T,T,T,T,T,T,T,T,T,C,T,T,T,T,T,T,T,T,T,T,T,T,T,T,T,T,T,T,T,T,C,T,C,C,C,T,T,T,T,T,T,T,C,T,T,T,T,C,T,T,C,T,C,C,C,T,T,T,T,T,T,T,T,T,C,T,C,C,T,T,
19,4269398,"rs39045033","A/G","U5:Ssh3","19:all",A,A,A,G,A,A,G,G,A,G,G,G,A,G,A,A,G,A,A,A,A,G,A,A,A,A,A,A,A,A,A,G,A,A,A,A,A,G,A,G,G,G,A,A,A,A,G,G,A,G,A,A,A,A,G,G,A,G,G,G,G,G,A,A,A,A,G,A,G,A,A,G,A,G,G,A,A,
19,4301482,"rs230003815","C/T","I:Adrbk1","19:all",C,C,C,T,C,C,T,T,C,T,T,T,C,T,,C,T,C,C,C,C,,C,C,C,C,C,C,C,C,C,T,C,C,C,C,C,T,C,T,T,T,C,C,C,C,T,T,C,T,C,C,C,C,T,T,C,T,T,,,T,C,C,C,C,T,C,,C,C,T,C,T,T,C,C,
19,4304147,"rs30496456","C/T","I:Adrbk1","19:all",T,T,C,T,C,T,T,C,C,C,C,C,C,C,T,T,T,C,T,T,T,C,T,T,T,T,C,T,T,T,T,C,T,T,T,C,C,T,T,T,T,T,T,C,T,C,C,C,T,T,C,T,C,T,T,C,T,T,C,T,T,T,C,T,T,T,C,T,C,T,C,T,T,T,T,T,T,
19,4308731,"rs30911224","A/G","","19:all",A,A,G,G,G,A,G,G,G,G,G,G,G,G,A,A,G,G,A,A,A,G,A,A,A,A,G,A,A,A,A,G,A,A,A,G,G,G,A,G,G,G,A,G,A,G,G,G,A,G,G,A,G,A,G,G,A,G,G,G,G,G,G,A,A,A,G,A,G,A,G,G,A,G,G,A,A,
19,4312228,"rs31157180","C/T","","19:all",C,C,T,C,T,C,C,T,T,T,T,T,T,T,C,C,C,T,C,C,C,T,C,C,C,C,T,C,C,C,C,T,C,C,C,T,T,C,C,C,C,C,C,T,C,T,T,T,C,C,T,C,T,C,C,T,C,C,T,C,C,C,T,C,C,C,T,C,T,C,T,C,C,C,C,C,C,
19,4312730,"rs31124026","A/C","","19:all",C,C,A,C,A,C,C,A,A,A,A,,,,C,C,C,,C,C,C,,C,C,C,C,A,C,C,C,C,A,C,C,C,A,A,C,C,C,C,C,C,A,C,A,A,A,C,C,A,C,A,C,C,A,C,C,,C,C,C,A,C,C,C,A,C,A,C,A,C,C,C,C,C,C,
19,4321380,"rs45770255","A/G","I:Kdm2a","19:all",A,A,A,G,A,A,G,A,G,G,G,G,G,G,G,G,G,G,G,H,G,G,,,,,G,,,G,,,,,,,,,,,,G,,,,,,,,,,,,,,,,G,G,,,,,,,,,,,,,,,G,G,G,,
19,4326410,"rs30612704","C/T","I:Kdm2a","19:all",C,C,T,T,T,C,C,T,T,T,T,T,T,T,C,C,T,T,C,C,C,T,C,C,C,C,T,C,C,C,C,T,C,C,C,T,T,T,C,C,C,C,C,T,C,T,T,T,C,T,T,C,T,C,C,T,C,T,T,C,C,T,T,C,C,C,T,C,T,C,T,T,C,T,C,C,C,
19,4347404,"rs37300956","A/G","I:Kdm2a","19:all",G,G,G,A,G,G,G,G,G,G,G,G,G,G,G,G,A,G,G,G,G,G,G,G,G,G,G,G,G,G,G,G,G,G,G,G,G,A,G,G,G,G,G,G,G,G,G,G,G,A,G,G,G,G,G,G,G,A,G,G,G,A,G,G,G,G,G,G,G,G,G,A,G,A,G,G,G,
19,4390267,"rs30353228","C/T","I:Kdm2a","19:all",C,C,T,C,T,C,C,T,T,T,T,,T,T,C,C,C,T,C,C,C,T,C,C,C,C,T,C,C,C,C,T,C,C,C,T,T,C,C,C,C,C,C,T,C,T,T,T,C,C,T,C,T,C,C,T,C,C,T,C,C,C,T,C,C,C,T,C,T,C,T,C,C,C,C,C,C,
19,4393965,"rs47702670","A/G","I:Kdm2a","19:all",A,A,A,G,A,A,G,A,A,A,A,,,,,A,G,,A,A,A,,A,A,A,A,A,A,A,A,A,A,A,A,A,A,A,G,A,G,G,G,A,A,A,A,A,A,A,G,A,A,A,A,G,A,A,G,,G,G,G,A,A,A,A,A,A,A,A,A,G,A,G,G,A,A,
19,4416152,"rs30425571","A/G","","19:all",G,G,A,A,A,G,A,G,A,G,G,G,A,G,G,G,A,A,G,G,G,G,G,G,G,G,A,G,G,G,G,G,G,G,G,A,A,A,G,A,A,A,G,A,G,A,G,G,G,A,A,G,A,G,A,G,G,A,G,A,A,A,A,G,G,G,G,G,G,G,A,A,G,A,A,G,G,
19,4540453,"rs30621455","C/T","I:Pcx","19:all",T,T,C,C,C,T,C,T,T,T,T,T,T,T,T,T,T,T,T,T,T,T,T,T,T,T,T,T,T,T,T,T,T,T,T,T,T,T,T,T,T,T,T,T,T,T,T,T,T,T,T,T,T,T,T,T,T,T,T,T,T,T,T,T,T,T,T,T,T,T,T,T,T,T,T,T,T,
19,4545934,"rs37636721","A/G","I:Pcx","19:all",A,A,A,A,A,A,A,A,A,A,A,A,A,A,A,A,A,A,A,A,A,A,A,A,A,A,A,A,A,A,A,A,A,A,A,A,A,A,A,A,A,A,A,A,A,A,A,A,A,A,A,A,A,A,A,A,A,A,A,A,A,A,A,A,A,A,A,A,A,A,A,A,A,A,A,A,A,
19,4560490,"rs30420006","C/T","I:Pcx","19:all",C,C,T,C,T,C,C,C,T,C,C,C,T,C,C,C,C,T,C,C,C,C,C,C,C,C,T,C,C,C,C,C,C,C,C,T,T,C,C,C,C,C,C,T,C,T,C,C,C,C,T,C,T,C,C,C,C,C,C,C,C,C,T,C,C,C,C,C,C,C,T,C,C,C,C,C,C,
19,4607468,"rs257458257","A/G","I:Pcx","19:all",A,A,A,G,A,A,G,A,A,A,A,A,A,A,,A,G,A,A,A,A,,A,A,A,A,A,A,A,A,A,A,A,A,A,A,A,G,A,G,G,G,A,A,A,A,A,A,A,G,A,A,A,A,G,A,A,G,A,G,G,G,A,A,A,A,A,A,A,A,A,G,A,G,G,A,A,
19,4610061,"rs248893242","C/T","I:Pcx","19:all",T,T,T,C,T,T,C,C,T,C,C,C,T,C,,H,C,T,T,,,C,T,T,T,T,T,T,T,T,T,C,T,T,T,T,T,C,T,C,C,C,T,T,T,T,C,C,T,C,T,T,T,T,C,C,T,C,C,C,C,C,T,T,T,T,C,T,,T,T,C,T,C,C,T,T,
19,4628058,"rs50395346","A/G","I:Gm960","19:all",A,A,G,A,G,A,G,G,G,G,G,G,G,G,A,A,A,G,A,A,A,G,A,A,A,A,G,A,A,A,A,G,A,A,A,G,G,A,A,G,G,G,A,G,A,G,G,G,A,A,G,A,G,A,G,G,A,A,G,G,G,A,G,A,A,A,G,A,G,A,G,A,A,A,G,A,A,
19,4662861,,,"","19:all",G,G,G,G,G,G,G,G,G,G,G,G,G,G,G,G,G,G,G,G,G,G,G,G,G,G,G,G,G,G,G,G,G,G,G,G,G,G,G,G,G,G,G,G,G,G,G,G,G,G,G,G,G,G,G,G,G,G,G,G,G,G,G,G,G,G,G,G,G,G,G,G,G,G,G,G,G,
19,4685791,"rs30808302","A/G","I:Gm960","19:all",G,G,G,A,G,G,A,A,A,A,A,A,A,A,A,A,A,A,A,A,A,A,A,A,A,A,A,A,A,A,A,A,A,A,A,A,A,A,A,A,A,A,A,A,A,A,A,A,A,A,A,A,A,A,A,A,A,A,A,A,A,A,A,A,A,A,A,A,A,A,A,A,A,A,A,A,A,
19,4732824,"rs30958027","A/G","I:Sptbn2","19:all",G,G,A,G,A,G,A,G,A,G,G,G,A,G,G,G,G,A,G,G,G,G,G,G,G,G,A,G,G,G,G,G,G,G,G,A,A,G,G,A,A,A,G,A,G,A,G,G,G,G,A,G,A,G,A,G,G,G,G,A,A,G,A,G,G,G,G,G,G,G,A,G,G,G,A,G,G,
19,4820280,"rs220823013","A/C","","19:all",A,A,A,C,A,A,C,A,A,A,A,A,A,A,A,A,C,A,A,A,A,A,A,A,A,A,A,A,A,A,A,A,A,A,A,A,A,C,A,C,C,C,A,A,A,A,A,A,A,C,A,A,A,A,C,A,A,C,A,C,C,C,A,A,A,A,A,A,A,A,A,C,A,C,C,A,A,
19,4825813,,,"","19:all",,,,,,,,,C,C,C,C,C,C,C,C,C,C,C,C,C,C,C,C,C,C,C,C,C,C,C,C,C,C,C,C,C,C,C,C,C,C,C,C,C,C,C,C,C,C,C,C,C,C,C,C,C,C,C,C,C,C,C,C,C,C,C,C,C,C,C,C,C,C,C,C,C,
19,4834103,"rs40009042","A/C","I:Ccs","19:all",C,C,C,A,C,C,C,C,C,C,C,C,C,C,C,C,A,C,C,C,C,C,C,C,C,C,C,C,C,C,C,C,C,C,C,C,C,A,C,C,C,C,C,C,C,C,C,C,C,A,C,C,C,C,C,C,C,A,C,C,C,A,C,C,C,C,C,C,C,C,C,A,C,A,C,C,C,
19,4837633,"rs52030466","C/T","I:Ccs","19:all",T,T,T,C,T,T,C,C,T,H,H,H,T,H,T,T,H,T,T,T,T,,T,T,T,T,T,T,T,T,T,,T,T,T,T,T,,T,,,H,T,T,T,,,,T,,T,T,T,T,,,T,H,H,,,,T,T,T,T,,T,,T,T,,T,H,H,T,T,
19,4907657,"rs13464037","A/G","Cn:Dpp3:ND:728","19:all",T,T,C,C,C,T,C,C,C,C,C,C,C,C,T,T,C,C,T,T,T,C,T,T,T,T,C,T,T,T,T,C,T,T,T,C,C,C,T,C,C,C,T,C,T,C,C,C,T,C,C,T,C,T,C,C,T,C,C,C,C,C,C,T,T,T,C,T,C,T,C,C,T,C,C,T,T,
19,4950050,"rs265609918","A/C","","19:all",A,A,C,A,C,A,A,C,A,A,A,A,A,A,A,A,A,A,A,A,A,A,A,A,A,A,A,A,A,A,A,A,A,A,A,A,A,A,A,A,A,A,A,A,A,A,A,A,A,A,A,A,A,A,A,A,A,A,A,A,A,A,A,A,A,A,A,A,A,A,A,A,A,A,A,A,A,
19,4989312,"rs31089405","C/T","I:Npas4","19:all",C,C,T,C,T,C,C,C,T,C,C,C,T,C,C,C,C,T,C,C,C,C,C,C,C,C,T,C,C,C,C,C,C,C,C,T,T,C,C,C,C,C,C,T,C,T,C,C,C,C,T,C,T,C,C,C,C,C,C,C,C,C,T,C,C,C,C,C,C,C,T,C,C,C,C,C,C,
19,4998747,"rs38473078","A/G","I:Npas4","19:all",A,A,A,G,A,A,G,A,A,A,A,A,A,A,A,A,G,A,A,A,A,A,A,A,A,A,A,A,A,A,A,A,A,A,A,A,A,G,A,G,G,G,A,A,A,A,A,A,A,G,A,A,A,A,G,A,A,G,A,G,G,G,A,A,A,A,A,A,A,A,A,G,A,G,G,A,A,
19,5009612,,,"","19:all",G,G,G,,G,G,G,G,G,G,G,G,G,G,G,G,G,G,G,G,G,G,,,,,G,,,G,,,,,,,,,,,,G,,,,,,,,,,,,,,,,G,G,,,,,,,,,,,,,,,G,G,G,,
19,5089938,"rs30762561","A/C","I:Yif1a","19:all",A,A,C,C,C,A,C,C,C,C,C,C,C,H,A,A,C,C,A,A,A,C,A,A,A,A,C,A,A,A,A,C,A,A,A,C,C,C,A,C,C,C,A,C,A,C,C,C,A,C,C,A,C,A,C,C,A,C,C,C,C,C,C,A,A,A,C,A,C,A,C,C,A,C,C,A,A,
19,5093180,"rs31255805","C/T","U3:Cnih2","19:all",C,C,T,T,T,C,C,T,T,T,T,T,T,H,C,C,T,T,C,C,C,T,C,C,C,C,T,C,C,C,C,T,C,C,C,T,T,T,C,C,C,C,C,T,C,T,T,T,C,T,T,C,T,C,C,T,C,T,T,C,C,T,T,C,C,C,T,C,T,C,T,T,C,T,C,C,C,
19,5099671,"rs31190820","C/T","U3:Rab1b","19:all",T,T,C,C,C,T,T,C,C,C,C,C,C,H,T,T,C,C,,T,T,C,T,T,T,T,C,T,T,T,T,C,T,T,T,C,C,C,T,T,T,T,T,C,T,C,C,C,T,C,C,T,C,T,T,C,T,C,C,T,,C,C,T,T,T,C,T,C,T,C,C,T,C,T,T,T,
19,5106555,"rs37449127","A/C","I:Rab1b","19:all",C,C,C,A,C,C,A,A,C,A,A,A,C,H,C,C,A,C,C,C,C,A,C,C,C,C,C,C,C,C,C,A,C,C,C,C,C,A,C,A,A,A,C,C,C,C,A,A,C,A,C,C,C,C,A,A,C,A,A,A,A,A,C,C,C,C,A,C,A,C,C,A,C,A,A,C,C,
19,5112813,"rs30324687","G/T","Cs:Klc2:P:219 NC:Klc2","19:all",G,G,T,G,T,G,G,G,T,G,G,G,T,G,G,G,G,T,G,G,G,G,G,G,G,G,T,G,G,G,G,G,G,G,G,T,T,G,G,G,G,G,G,T,G,T,G,G,G,G,T,G,T,G,G,G,G,G,G,G,G,G,T,G,G,G,G,G,G,G,T,G,G,G,G,G,G,
19,5198615,"rs249193353","G/T","I:Pacs1","19:all",,,,,,,,,T,T,T,T,T,H,G,G,G,T,G,G,G,T,G,G,G,G,T,G,G,G,G,T,G,G,G,T,T,G,G,G,G,G,G,T,G,T,T,T,G,G,T,G,T,G,G,T,G,G,T,G,G,G,T,G,G,G,T,G,T,G,T,G,G,G,G,G,G,
19,5202128,"rs30370715","C/T","I:Pacs1","19:all",T,T,C,C,C,T,C,C,C,C,C,C,C,H,T,T,C,C,T,T,T,C,T,T,T,T,C,T,T,T,T,C,T,T,T,C,C,C,T,C,C,C,T,C,T,C,C,C,T,C,C,T,C,T,C,C,T,C,C,C,C,C,C,T,T,T,C,T,C,T,C,C,T,C,C,T,T,
19,5206280,"rs31146388","G/T","I:Pacs1","19:all",T,T,G,G,G,T,G,T,G,T,T,T,,T,T,T,G,G,T,T,T,T,T,T,T,T,G,T,T,T,T,T,T,T,T,G,G,G,T,G,G,G,T,G,T,G,T,T,T,G,G,T,G,T,G,T,T,G,T,G,G,G,G,T,T,T,T,T,T,T,G,G,T,G,G,T,T,
19,5268749,"rs30950956","A/G","I:Pacs1","19:all",A,A,G,A,G,A,G,G,G,G,G,G,,H,A,A,A,G,A,A,A,G,A,A,A,A,G,A,A,A,A,G,A,A,A,G,G,A,A,G,G,G,A,G,A,G,G,G,A,A,G,A,G,A,G,G,A,A,G,G,G,A,G,A,A,A,G,A,G,A,G,A,A,A,G,A,A,
19,5340514,"rs13483506","A/C","I:Catsper1","19:all",C,C,A,C,A,C,A,A,A,A,A,A,A,H,C,C,C,A,C,C,C,A,C,C,C,C,A,C,C,C,C,A,C,C,C,A,A,C,C,A,A,A,C,A,C,A,A,A,C,C,A,C,A,C,A,A,C,C,A,A,A,C,A,C,C,C,A,C,A,C,A,C,C,C,A,C,C,
19,5374843,"rs36362872","A/G","","19:all",G,G,G,G,G,G,A,G,G,G,G,G,G,G,G,G,G,G,G,G,G,G,G,G,G,G,G,G,G,G,G,G,G,G,G,G,G,G,G,A,A,A,G,G,G,G,G,G,G,G,G,G,G,G,A,G,G,G,G,A,A,G,G,G,G,G,G,G,G,G,G,G,G,G,A,G,G,
19,5433373,"rs30653270","A/G","","19:all",G,G,A,G,A,G,G,A,A,A,A,A,A,H,G,G,G,A,G,G,G,A,G,G,G,G,A,G,G,G,G,A,G,G,G,A,A,G,G,G,G,G,G,A,G,A,A,A,G,G,A,G,A,G,G,A,G,G,A,G,G,G,A,G,G,G,A,G,A,G,A,G,G,G,G,G,G,
19,5443833,"rs225120654","A/G","","19:all",G,G,A,G,A,G,G,G,A,G,G,G,A,G,G,G,G,A,G,G,G,G,G,G,G,G,A,G,G,G,G,G,G,G,G,A,A,G,G,G,G,G,G,A,G,A,G,G,G,G,A,G,A,G,G,G,G,G,G,G,G,G,A,G,G,G,G,G,G,G,A,G,G,G,G,G,G,
19,5446358,"rs31159399","C/T","","19:all",T,T,C,C,C,T,C,C,C,C,C,C,C,H,T,T,C,C,T,T,T,C,T,T,T,T,C,T,T,T,T,C,T,T,T,C,C,C,T,C,C,C,T,C,T,C,C,C,T,C,C,T,C,T,C,C,T,C,C,C,C,C,C,T,T,T,C,T,C,T,C,C,T,C,C,T,T,
19,5503832,"rs52088482","A/G","I:Snx32","19:all",G,G,A,G,A,G,G,G,A,G,G,G,A,G,,G,G,,G,G,G,,G,G,,G,A,G,G,G,G,G,G,G,G,A,A,,G,G,G,G,,,G,A,G,G,,G,A,G,,G,G,G,G,G,G,G,G,G,,G,G,G,G,G,,G,A,G,,G,G,G,G,
19,5521702,"rs211874556","A/G","I:Gm31166","19:all",G,G,G,A,G,G,A,G,G,G,G,G,G,G,G,G,A,G,G,G,G,G,G,G,G,G,G,G,G,G,G,G,G,G,G,G,G,A,G,A,A,A,G,G,G,G,G,G,G,A,G,G,G,G,A,G,G,A,G,A,A,A,G,G,G,G,G,G,G,G,G,A,G,A,A,G,G,
19,5525005,"rs215479623","C/T","I:Gm31166","19:all",T,T,C,C,C,T,C,T,C,T,T,T,C,T,T,T,C,C,T,T,T,T,T,T,T,T,C,T,T,T,T,T,T,T,T,C,C,C,T,C,C,C,T,C,T,C,T,T,T,C,C,T,C,T,C,T,T,C,T,C,C,C,C,T,T,T,T,T,T,T,C,C,T,C,C,T,T,
19,5543534,"rs30349664","A/G","I:Gm31166","19:all",A,A,G,G,G,A,G,A,G,,A,A,G,A,A,A,,G,A,A,A,A,,,,,G,,,A,,,,,,,,,,,,G,,,,,,,,,,,,,,,,G,A,,,,,,,,,,,,,,,G,G,A,,
19,5650883,"rs31283650","C/T","","19:all",T,T,C,T,C,T,C,C,C,C,C,C,C,H,T,T,T,C,T,T,T,C,T,T,T,T,C,T,T,T,T,C,T,T,T,C,C,T,T,C,C,C,T,C,T,C,C,C,T,T,C,T,C,T,C,C,T,T,C,C,C,T,C,T,T,T,C,T,C,T,C,T,T,T,C,T,T,
19,5681360,"rs214371744","A/C","","19:all",C,C,C,A,C,C,A,C,C,C,C,C,C,C,C,C,A,C,C,C,C,C,C,C,C,C,C,C,C,C,C,C,C,C,C,C,C,A,C,A,A,A,C,C,C,C,C,C,C,A,C,C,C,C,A,C,C,A,C,A,A,A,C,C,C,C,C,C,C,C,C,A,C,A,A,C,C,
19,5686580,"rs36936073","G/T","","19:all",T,T,G,G,G,T,G,G,G,G,G,G,G,H,T,T,G,G,T,T,T,G,T,T,T,T,G,T,T,T,T,G,T,T,T,G,G,G,T,G,G,G,T,G,T,G,G,G,T,G,G,T,G,T,G,G,T,G,G,G,G,G,G,T,T,T,G,T,G,T,G,G,T,G,G,T,T,
19,5689430,"rs30985471","C/T","","19:all",T,T,C,T,C,T,C,C,C,C,C,C,C,H,T,T,T,C,T,T,T,C,T,T,T,T,C,T,T,T,T,C,T,T,T,C,C,T,T,C,C,C,T,C,T,C,C,C,T,T,C,T,C,T,C,C,T,T,C,C,C,T,C,T,T,T,C,T,C,T,C,T,T,T,C,T,T,
19,5702495,"rs36740098","C/T","","19:all",T,T,T,T,T,T,C,T,T,T,T,T,T,T,T,T,T,T,T,T,T,T,T,T,T,T,T,T,T,T,T,T,T,T,T,T,T,T,T,C,C,C,,T,,T,T,T,T,T,T,T,T,T,C,T,T,T,T,C,C,T,T,T,T,T,T,T,T,T,T,T,T,T,C,T,T,
19,5734552,"rs30888317","C/T","","19:all",C,C,T,,T,C,T,T,T,T,T,T,T,H,C,C,,T,C,C,C,T,C,C,C,C,T,C,C,C,C,T,C,C,C,T,T,,C,T,T,T,C,T,C,T,T,T,C,,T,C,T,C,T,T,C,,T,T,T,,T,C,C,C,T,C,T,C,T,,C,,T,C,C,
19,5737412,"rs218552483","A/C","","19:all",A,A,A,C,A,A,C,A,A,A,A,A,A,A,A,A,C,A,A,A,A,A,A,A,A,A,A,A,A,A,A,A,A,A,A,A,A,C,A,C,C,C,A,A,A,A,A,A,A,C,A,A,A,A,C,A,A,C,A,C,C,C,A,A,A,A,A,A,A,A,A,C,A,C,C,A,A,
19,5751156,"rs31182232","A/C","I:Ltbp3","19:all",A,A,C,A,C,A,C,C,C,C,C,C,C,H,A,A,A,C,A,A,A,C,A,A,A,A,C,A,A,A,A,C,A,A,A,C,C,A,A,,,C,A,C,A,C,C,C,A,A,C,A,C,A,,C,A,A,C,,,A,C,A,A,A,C,A,C,A,C,A,A,A,C,A,A,
19,5758189,"rs39057026","C/T","U3:Ltbp3","19:all",C,C,C,C,C,C,C,T,C,T,T,T,C,H,C,C,C,C,C,C,C,T,C,C,C,C,C,C,C,C,C,T,C,C,C,C,C,C,C,C,C,C,C,C,C,C,T,T,C,C,C,C,C,C,C,T,C,C,T,C,C,C,C,C,C,C,T,C,T,C,C,C,C,C,C,C,C,
19,5758286,"rs13473125","G/T","U3:Ltbp3","19:all",A,A,C,C,C,A,C,C,C,C,C,C,C,H,A,A,C,C,A,A,A,C,A,A,A,A,C,A,A,A,A,C,A,A,A,C,C,C,A,C,C,C,A,C,A,C,C,C,A,C,C,A,C,A,C,C,A,C,C,C,C,C,C,A,A,A,C,A,C,A,C,C,A,C,C,A,A,
19,5761445,"rs264925186","A/C","I:Scyl1","19:all",A,A,A,C,A,A,C,A,A,A,A,A,A,A,A,A,,A,A,A,A,A,A,A,A,A,A,A,A,A,A,A,A,A,A,A,A,,A,,,H,A,A,A,A,A,A,A,,A,A,A,A,,A,A,H,A,,,,A,A,A,A,A,A,A,A,A,,A,,H,A,A,
19,5831650,"rs36859272","A/G","NC:Neat1","19:all",A,A,A,G,A,A,A,A,A,A,A,A,A,A,A,A,G,A,A,A,A,A,A,A,A,A,A,A,A,A,A,A,A,A,A,A,A,G,A,A,A,A,A,A,A,A,A,A,A,G,A,A,A,A,A,A,A,G,A,A,A,G,A,A,A,A,A,A,A,A,A,G,A,G,A,A,A,
19,5838396,,,"","19:all",,,,,,,,,T,T,T,T,T,T,T,T,T,T,T,T,T,T,T,T,T,T,T,T,T,T,T,T,T,T,T,T,T,T,T,T,T,T,T,T,T,T,T,T,T,T,T,T,T,T,T,T,T,T,T,T,T,T,T,T,T,T,T,T,T,T,T,T,T,T,T,T,T,
19,5872016,"rs212534337","C/T","I:Frmd8","19:all",T,T,T,C,T,T,C,C,T,C,C,C,T,H,T,T,C,T,T,T,T,C,T,T,T,T,T,T,T,T,T,C,T,T,T,T,T,C,T,C,C,C,T,T,T,T,C,C,T,C,T,T,T,T,C,C,T,C,C,C,C,C,T,T,T,T,C,T,C,T,T,C,T,C,C,T,T,
19,5949434,"rs36732727","A/G","I:Pola2","19:all",G,G,G,G,G,G,G,G,G,G,G,G,G,G,G,G,G,G,G,G,G,G,G,G,G,G,G,G,G,G,G,G,G,G,G,G,G,G,G,G,G,G,G,G,G,G,G,G,G,G,G,G,G,G,G,G,G,G,G,G,G,G,G,G,G,G,G,G,G,G,G,G,G,G,G,G,G,
19,5950370,"rs30815128","A/G","I:Pola2","19:all",A,A,G,A,G,A,A,G,G,G,G,G,G,H,A,A,A,G,A,A,A,G,A,A,A,A,G,A,A,A,A,G,A,A,A,G,G,A,A,A,A,A,A,G,A,G,G,G,A,A,G,A,G,A,A,G,A,A,G,A,A,A,G,A,A,A,G,A,G,A,G,A,A,A,A,A,A,
19,6027842,"rs36711459","A/G","","19:all",G,G,A,G,A,G,A,A,A,A,A,A,A,H,,G,G,A,H,H,G,,G,G,G,G,A,G,G,G,G,A,G,G,G,A,A,G,G,A,A,A,G,A,G,A,,A,G,,A,G,A,G,A,A,G,G,A,A,A,G,A,G,G,G,,G,A,G,A,,G,G,A,G,G,