chr,bp38,rs,observed,dbsnp142annot,requested,"129P2/OlaHsd::834","129S1/SvImJ::3","129S2/SvHsd::835","129S4/SvJaeJ::782","129S6/SvEvTac::53","129T2/SvEmsJ::51","129X1/SvJ::47","A/J::4","AKR/J::15","AXB1/PgnJ::230","AXB10/PgnJ::231","AXB11/Pgn::261","AXB12/PgnJ::232","AXB13/PgnJ::233","AXB14/Pgn::290","AXB15/PgnJ::234","AXB17/Pgn::263","AXB18/Pgn::291","AXB19/PgnJ::236","AXB2/PgnJ::237","AXB20/Pgn::292","AXB21/Pgn::264","AXB23/PgnJ::239","AXB24/PgnJ::240","AXB3/Pgn::265","AXB4/PgnJ::241","AXB5/PgnJ::242","AXB6/PgnJ::243","AXB7/Pgn::266","AXB8/PgnJ::244","AXB9/Pgn::267","BALB/cByJ::50","BALB/cJ::5","BPH/2J::23","BPL/1J::19","BPN/3J::27","BTBR T<+> Itpr3<tf>/J::1","BUB/BnJ::24","BXA1/PgnJ::245","BXA11/PgnJ::246","BXA12/PgnJ::247","BXA13/PgnJ::248","BXA14/PgnJ::249","BXA16/PgnJ::250","BXA17/PgnJ::293","BXA18/Pgn::269","BXA2/PgnJ::252","BXA20/Pgn::270","BXA22/Pgn::271","BXA23/Pgn::272","BXA24/PgnJ::253","BXA25/PgnJ::254","BXA26/PgnJ::255","BXA4/PgnJ::256","BXA7/PgnJ::257","BXA8/PgnJ::258","BXD1/TyJ::422","BXD11/TyJ::423","BXD12/TyJ::424","BXD13/TyJ::425","BXD14/TyJ::426","BXD15/TyJ::427","BXD16/TyJ::428","BXD18/TyJ::429","BXD19/TyJ::430","BXD2/TyJ::431","BXD20/TyJ::432","BXD21/TyJ::433","BXD22/TyJ::434","BXD23/TyJ::435","BXD24/TyJ::458","BXD25/TyJ::437","BXD27/TyJ::438","BXD28/TyJ::439","BXD29/Ty::462","BXD30/Ty::441","BXD31/TyJ::442","BXD32/TyJ::443","BXD33/TyJ::444","BXD34/TyJ::445","BXD35/Ty::446","BXD36/TyJ::447","BXD37/Ty::448","BXD38/TyJ::449","BXD39/TyJ::450","BXD40/TyJ::451","BXD41/Ty::452","BXD42/TyJ::453","BXD5/TyJ::457","BXD6/TyJ::454","BXD8/TyJ::455","BXD9/TyJ::456","BXD100::1100","BXD43::1143","BXD44::1144","BXD45::1145","BXD48::1148","BXD49::1149","BXD50::1150","BXD51::1151","BXD52::1152","BXD53::1153","BXD54::562","BXD55::1155","BXD56::1156","BXD59::1159","BXD60::1160","BXD61::1161","BXD62::1162","BXD63::1163","BXD64::1164","BXD65::1165","BXD66::1166","BXD67::1167","BXD68::1168","BXD69::1169","BXD70::1170","BXD71::1171","BXD72::578","BXD73::1173","BXD74::1174","BXD75::1175","BXD76::1176","BXD77::1177","BXD78::1178","BXD79::1179","BXD80::1180","BXD81::1181","BXD83::1183","BXD84::1184","BXD85::1185","BXD86::1186","BXD87::1187","BXD88::1188","BXD89::1189","BXD90::1190","BXD91::1191","BXD92::1192","BXD93::1193","BXD94::1194","BXD95::1195","BXD96::1196","BXD97::1197","BXD98::1198","BXD99::1199","BXH10/TyJ::470","BXH11/TyJ::471","BXH12/Ty::472","BXH14/TyJ::473","BXH19/TyJ::474","BXH2/TyJ::475","BXH3/TyJ::476","BXH4/TyJ::477","BXH6/TyJ::478","BXH7/TyJ::479","BXH8/TyJ::480","BXH9/TyJ::481","BXH20/KccJ::486","BXH21/Kcc::487","BXH22/KccJ::488","B6cC3-1/KccJ::489","C3H/HeJ::6","C3HeB/FeJ::59","C57BL/10J::38","C57BL/6ByJ::95","C57BL/6J::7","C57BL/6JBomTac::838","C57BL/6JCrl::874","C57BL/6JOlaHsd::836","C57BL/6NCrl::839","C57BL/6NHsd::837","C57BL/6NJ::182","C57BL/6NNIH::875","C57BL/6NTac::873","C57BLKS/J::35","C57BR/cdJ::32","C57L/J::37","C58/J::28","CALB/RkJ::83","CAST/EiJ::2","CBA/J::16","CE/J::25","CXB1/ByJ::400","CXB10/HiAJ::401","CXB11/HiAJ::402","CXB12/HiAJ::403","CXB13/HiAJ::404","CXB3/ByJ::405","CXB5/ByJ::406","CXB6/ByJ::407","CXB7/ByJ::408","CXB8/HiAJ::409","CXB9/HiAJ::410","CXBE::411","CXBH::412","CZECHII/EiJ::43","DBA/1J::65","DBA/2J::8","DDK/Pas::137","DDY/JclSidSeyFrkJ::154","EL/SuzSeyFrkJ::155","FVB/NJ::9","HTG/GoSfSnJ::45","I/LnJ::30","ILS/IbgTejJ::611","IS/CamRkJ::156","ISS/IbgTejJ::610","JF1/MsJ::121","KK/HlJ::18","LEWES/EiJ::88","LG/J::78","LP/J::10","MA/MyJ::20","MAI/Pas::163","MOLF/EiJ::40","MOLG/DnJ::44","MRL/MpJ::58","MSM/MsJ::120","NOD/ShiLtJ::13","NON/ShiLtJ::34","NOR/LtJ::106","NZB/BlNJ::11","NZL/LtJ::169","NZO/HlLtJ::122","NZW/LacJ::36","O20::780","P/J::55","PERA/EiJ::41","PERC/EiJ::135","PL/J::14","PWD/PhJ::101","PWK/PhJ::217","QSi5::781","RBA/DnJ::136","RF/J::74","RIIIS/J::26","SEA/GnJ::29","SEG/Pas::164","SJL/J::17","SKIVE/EiJ::100","SM/J::31","SOD1/EiJ::133","SPRET/EiJ::39","ST/bJ::69","SWR/J::12","TALLYHO/JngJ::46","WSB/EiJ::42","ZALENDE/EiJ::80",
3,44030607,"rs31094388","C/T","","3:44-47",T,T,T,T,T,T,T,C,T,T,T,C,T,T,C,C,C,C,C,C,C,T,T,T,C,C,T,T,T,C,C,T,T,T,T,T,T,C,C,T,C,C,T,T,T,T,T,H,C,T,T,T,T,C,T,T,T,T,T,T,T,T,T,T,T,T,T,T,T,T,T,T,T,T,T,T,T,T,T,T,T,T,T,T,T,T,T,T,T,T,T,T,T,T,T,T,T,T,T,T,T,T,T,T,T,T,T,T,T,T,T,T,T,T,T,T,T,T,T,T,T,T,T,T,T,T,T,T,T,T,T,T,T,T,T,T,T,T,T,T,T,T,T,T,T,T,T,C,T,T,C,T,C,C,C,T,T,T,T,T,H,C,C,T,T,T,T,T,T,T,T,T,T,T,T,T,T,T,,,C,T,T,T,T,T,T,T,T,T,T,T,T,T,T,C,T,T,C,,T,C,T,C,C,C,T,C,T,C,T,T,T,C,C,C,T,C,T,C,T,C,T,T,C,T,T,C,C,C,C,,,T,T,C,T,T,C,,T,C,,C,C,C,C,T,
3,44034794,"rs31095661","C/G","","3:44-47",C,C,C,C,C,C,C,G,C,C,C,G,C,C,G,G,G,G,G,G,G,C,C,C,G,G,C,C,C,G,G,C,C,C,C,C,C,C,G,C,G,G,C,C,C,C,C,H,G,C,C,C,C,G,C,C,C,C,C,C,C,C,C,C,C,C,C,C,C,C,C,C,C,C,C,C,C,C,C,C,C,C,C,C,C,C,C,C,C,C,C,C,C,C,C,C,C,C,C,C,C,C,C,C,C,C,C,C,C,C,C,C,C,C,C,C,C,C,C,C,C,C,C,C,C,C,C,C,C,C,C,C,C,C,C,C,C,C,C,C,C,C,C,C,C,C,C,G,C,C,G,C,G,G,G,C,C,C,C,C,H,G,G,C,C,C,C,C,C,C,C,C,C,C,C,C,C,C,G,C,G,C,C,C,C,C,C,C,C,C,C,C,C,C,C,C,C,C,C,C,C,C,C,G,C,C,C,,C,G,C,C,C,,C,,C,,C,C,C,G,C,C,,C,C,G,G,G,,C,G,C,C,C,C,,C,C,C,C,,G,C,C,G,C,
3,44037288,"rs30752623","A/G","","3:44-47",G,G,G,G,G,G,G,A,G,G,G,A,G,G,A,A,A,A,A,A,A,G,G,G,A,A,G,G,G,A,A,G,G,G,G,G,G,A,A,G,A,A,G,G,G,G,G,H,A,G,G,G,G,A,G,G,G,G,G,G,G,G,G,G,G,G,G,G,G,G,G,G,G,G,G,G,G,G,G,G,G,G,G,G,G,G,G,G,G,G,G,G,G,G,G,G,G,G,G,G,G,G,G,G,G,G,G,G,G,G,G,G,G,G,G,G,G,G,G,G,G,G,G,G,G,G,G,G,G,G,G,G,G,G,G,G,G,G,G,G,G,G,G,G,G,G,G,A,G,G,A,G,A,A,A,G,G,G,G,G,H,A,A,G,G,G,G,G,G,G,G,G,G,G,G,G,G,G,A,A,A,A,G,G,G,G,G,G,G,G,G,G,G,G,G,A,G,G,A,A,G,A,G,A,A,A,G,A,G,A,G,G,G,A,A,A,G,A,G,A,G,A,G,G,A,G,G,A,A,A,A,A,A,G,G,A,G,,A,A,G,A,,A,A,A,A,A,
3,44048021,"rs31103032","A/C","","3:44-47",C,C,C,,C,C,C,A,,C,C,A,C,C,A,A,A,A,A,A,A,C,C,C,A,A,C,C,C,A,A,C,C,C,C,,C,C,A,C,A,A,C,C,C,C,C,H,A,C,C,C,C,A,C,C,C,C,C,C,C,C,C,C,C,C,C,C,C,C,C,C,C,C,C,C,C,C,C,C,C,C,C,C,C,C,C,C,C,C,C,C,C,C,C,C,C,C,C,C,C,C,C,C,C,C,C,C,C,C,C,C,C,C,C,C,C,C,C,C,C,C,C,C,C,C,C,C,C,C,C,C,C,C,C,C,C,C,C,C,C,C,C,C,C,C,C,A,C,C,A,C,A,A,A,C,C,C,C,C,H,A,A,,C,C,C,C,C,C,C,C,C,C,C,C,C,C,A,A,A,A,C,C,C,C,C,C,C,C,C,C,C,C,C,C,C,C,,C,C,,C,A,,A,C,C,C,A,C,C,C,C,,,C,,C,,,A,C,C,,C,C,A,A,A,,,A,C,C,,C,,C,C,C,A,,A,,,A,A,
3,44050238,"rs31532613","C/T","","3:44-47",T,T,T,T,T,T,T,C,T,T,T,C,T,T,C,C,C,C,C,C,C,T,T,T,C,C,T,T,T,C,C,T,T,T,T,T,T,C,C,T,C,C,T,T,T,T,T,H,C,T,T,T,T,C,T,T,T,T,T,T,T,T,T,T,T,T,T,T,T,T,T,T,T,T,T,T,T,T,T,T,T,T,T,T,T,T,T,T,T,T,T,T,T,T,T,T,T,T,T,T,T,T,T,T,T,T,T,T,T,T,T,T,T,T,T,T,T,T,T,T,T,T,T,T,T,T,T,T,T,T,T,T,T,T,T,T,T,T,T,T,T,T,T,T,T,T,T,C,T,T,C,T,C,C,C,T,T,T,T,T,H,C,C,T,T,T,T,T,T,T,T,T,T,T,T,T,T,T,C,C,C,C,T,T,T,T,T,T,T,T,T,T,T,T,T,T,T,T,C,C,T,C,T,C,C,T,T,C,,C,T,T,T,C,C,C,,C,T,C,T,C,T,T,C,T,T,C,C,C,C,C,C,T,T,C,T,,C,C,,C,C,C,C,C,C,C,
3,44067644,"rs31740281","G/T","","3:44-47",T,T,T,T,T,T,T,G,T,T,T,G,T,T,G,G,G,G,G,G,G,T,T,T,G,G,T,T,T,G,G,T,T,T,T,,T,G,G,T,G,G,T,T,T,T,T,H,G,T,T,T,T,G,T,T,T,T,T,T,T,T,T,T,T,T,T,T,T,T,T,T,T,T,T,T,T,T,T,T,T,T,T,T,T,T,T,T,T,T,T,T,T,T,T,T,T,T,T,T,T,T,T,T,T,T,T,T,T,T,T,T,T,T,T,T,T,T,T,T,T,T,T,T,T,T,T,T,T,T,T,T,T,T,T,T,T,T,T,T,T,T,T,T,T,T,T,G,T,T,G,T,G,G,G,T,T,T,T,T,H,G,G,T,T,T,T,T,T,T,T,T,T,T,T,T,T,T,G,G,G,G,T,T,T,T,T,T,T,T,T,T,T,T,T,G,T,T,,G,T,,T,G,G,T,T,G,T,G,T,T,T,,T,G,T,G,T,,T,G,T,T,G,T,T,G,G,G,,,G,T,T,,T,G,G,G,,G,G,G,,G,G,G,
3,44076594,"rs30354330","A/C","","3:44-47",,A,,A,,A,A,C,,A,A,C,A,A,C,C,C,C,C,C,C,A,A,A,C,C,A,A,A,C,C,A,A,A,A,A,,C,C,A,C,C,A,A,A,A,A,H,C,A,A,A,A,C,A,A,A,A,A,A,A,A,A,A,A,A,A,A,A,A,A,A,A,A,A,A,A,A,A,A,A,A,A,A,A,A,A,A,A,A,A,A,A,A,A,A,A,A,A,A,A,A,A,A,A,A,A,A,A,A,A,A,A,A,A,A,A,A,A,A,A,A,A,A,A,A,A,A,A,A,A,A,A,A,A,A,A,A,A,A,A,A,A,A,A,A,A,C,A,A,C,A,C,C,C,A,A,A,A,A,H,C,C,A,A,A,,A,A,,,,A,A,A,A,A,A,C,C,C,C,A,A,A,A,A,A,A,A,A,A,A,A,A,C,A,A,C,C,A,C,,C,C,C,,C,A,C,A,A,A,C,C,C,A,C,A,C,,C,,,C,A,A,C,C,C,C,C,C,,A,C,A,,C,C,,C,,C,C,C,C,C,
3,44076691,"rs31729673","A/G","","3:44-47",A,A,A,A,A,A,A,G,A,A,A,G,A,A,G,G,G,G,G,G,G,A,A,A,G,G,A,A,A,G,G,A,A,A,,A,A,A,G,A,G,G,A,A,A,A,A,H,G,A,A,A,A,G,A,A,A,A,A,A,A,A,A,A,A,A,A,A,A,A,A,A,A,A,A,A,A,A,A,A,A,A,A,A,A,A,A,A,A,A,A,A,A,A,A,A,A,A,A,A,A,A,A,A,A,A,A,A,A,A,A,A,A,A,A,A,A,A,A,A,A,A,A,A,A,A,A,A,A,A,A,A,A,A,A,A,A,A,A,A,A,A,A,A,A,A,A,G,A,A,G,A,G,G,G,A,A,A,A,A,H,G,G,A,A,A,A,A,A,A,A,A,A,A,A,A,A,A,G,,G,G,A,A,A,A,A,A,A,A,A,A,A,A,A,A,A,A,A,A,A,A,A,G,A,A,A,A,A,G,A,A,A,A,A,A,A,A,A,A,,G,A,A,A,A,A,G,G,G,A,A,G,A,A,A,A,A,A,A,A,A,A,G,A,A,G,G,
3,44092047,"rs31545688","C/T","","3:44-47",T,T,T,T,T,T,T,C,T,T,T,C,T,T,C,C,C,C,C,C,C,T,T,T,C,C,T,T,T,C,C,T,T,T,T,T,T,T,C,T,C,C,T,T,T,T,T,H,C,T,T,T,T,C,T,T,T,T,T,T,T,T,T,T,T,T,T,T,T,T,T,T,T,T,T,T,T,T,T,T,T,T,T,T,T,T,T,T,T,T,T,T,T,T,T,T,T,T,T,T,T,T,T,T,T,T,T,T,T,T,T,T,T,T,T,T,T,T,T,T,T,T,T,T,T,T,T,T,T,T,T,T,T,T,T,T,T,T,T,T,T,T,T,T,T,T,T,C,T,T,C,T,C,C,C,T,T,T,T,T,H,C,C,T,T,T,T,T,T,T,T,T,T,T,T,T,T,T,C,T,C,C,T,T,T,T,T,T,T,T,T,T,T,T,T,T,T,T,T,,T,T,T,C,T,T,,,T,C,T,T,T,,T,T,T,,T,,,C,T,T,T,,T,C,C,C,,,C,T,T,,T,,T,T,,T,,C,T,T,C,C,
3,44092589,"rs30206007","C/T","","3:44-47",,T,T,T,,,T,C,T,T,T,C,T,T,C,C,C,C,C,C,C,T,T,T,C,C,T,T,T,C,C,T,T,T,T,,T,C,C,T,C,C,T,T,T,T,T,H,C,T,T,T,T,C,T,T,T,T,T,T,T,T,T,T,T,T,T,T,T,T,T,T,T,T,T,T,T,T,T,T,T,T,T,T,T,T,T,T,T,T,T,T,T,T,T,T,T,T,T,T,T,T,T,T,T,T,T,T,T,T,T,T,T,T,T,T,T,T,T,T,T,T,T,T,T,T,T,T,T,T,T,T,T,T,T,T,T,T,T,T,T,T,T,T,T,T,T,C,T,T,C,T,C,C,C,T,T,T,T,T,H,C,C,T,T,T,,T,T,,T,T,,,T,T,T,,C,C,C,C,T,T,T,T,T,T,T,T,T,T,T,T,T,C,T,T,C,C,T,C,T,C,C,T,T,C,T,C,T,T,T,C,C,C,T,C,T,C,T,C,,T,C,,T,C,C,C,C,C,C,,T,C,T,C,C,C,,T,C,C,C,C,C,C,
3,44154452,"rs3706854","C/T","","3:44-47",C,C,C,C,C,C,C,T,C,C,C,T,C,C,T,T,T,T,T,T,T,C,C,C,T,T,C,C,C,T,T,C,C,C,C,C,C,C,T,C,T,T,C,C,C,C,C,H,T,C,C,C,C,T,C,C,C,C,C,C,C,C,C,C,C,C,C,C,C,C,C,C,C,C,C,C,C,C,C,C,C,C,C,C,C,C,C,C,C,C,C,C,C,C,C,C,C,C,C,C,C,C,C,C,C,C,C,C,C,C,C,C,C,C,C,C,C,C,C,C,C,C,C,C,C,C,C,C,C,C,C,C,C,C,C,C,C,C,C,C,C,C,C,C,C,C,C,T,C,C,T,C,T,T,T,C,C,C,C,C,H,T,T,C,C,C,C,C,C,C,C,C,C,C,C,C,C,C,T,C,T,T,C,C,C,C,C,C,C,C,C,C,C,C,C,C,C,C,C,C,C,C,C,T,C,C,C,C,C,T,C,C,C,T,C,C,C,C,C,C,C,T,C,C,C,C,C,T,T,T,C,C,T,C,C,C,C,C,C,C,C,C,C,T,C,C,T,T,
3,44154620,"rs3722463","C/T","","3:44-47",,T,,,T,,T,C,T,T,T,C,T,T,C,C,C,C,C,C,C,T,T,T,C,C,T,T,T,C,C,T,T,T,T,T,T,T,C,T,C,C,T,T,T,T,T,H,C,T,T,T,T,C,T,T,T,T,T,T,T,T,T,T,T,T,T,T,T,T,T,T,T,T,T,T,T,T,T,T,T,T,T,T,T,T,T,T,T,T,T,T,T,T,T,T,T,T,T,T,T,T,T,T,T,T,T,T,T,T,T,T,T,T,T,T,T,T,T,T,T,T,T,T,T,T,T,T,T,T,T,T,T,T,T,T,T,T,T,T,T,T,T,T,T,T,T,C,T,T,C,T,C,C,C,T,T,T,T,T,H,C,C,T,,T,,,,,,,,,,T,T,T,C,T,C,C,T,T,T,T,T,T,T,T,T,T,T,T,T,,T,T,,T,T,T,,C,T,T,T,,T,C,T,T,T,,T,,T,T,T,T,T,,,T,T,,T,C,C,C,,T,,T,T,T,T,,T,T,T,,T,C,T,,C,C,
3,44216252,"rs30846761","A/G","","3:44-47",A,A,A,A,A,A,A,G,A,A,A,G,A,A,G,G,G,G,G,G,G,A,A,A,G,G,A,A,A,G,G,A,A,A,A,A,A,G,G,A,G,G,A,A,A,A,A,H,G,A,A,A,A,G,A,A,A,A,A,A,A,A,A,A,A,A,A,A,A,A,A,A,A,A,A,A,A,A,A,A,A,A,A,A,A,A,A,A,A,A,A,A,A,A,A,A,A,A,A,A,A,A,A,A,A,A,A,A,A,A,A,A,A,A,A,A,A,A,A,A,A,A,A,A,A,A,A,A,A,A,A,A,A,A,A,A,A,A,A,A,A,A,A,A,A,A,A,G,A,A,G,A,G,G,G,A,A,A,A,A,H,G,G,A,A,A,A,A,A,A,A,A,A,A,A,A,A,A,G,A,G,G,A,A,A,A,A,A,A,A,A,A,A,A,A,A,A,A,G,G,A,G,A,G,G,A,A,A,A,G,A,A,A,A,A,A,A,A,A,G,A,G,A,A,A,A,A,G,G,G,A,A,G,A,A,G,A,A,A,G,,A,A,G,A,G,G,G,
3,44216515,"rs30260115","C/G","","3:44-47",G,G,G,G,G,G,G,C,G,G,G,C,G,G,C,C,C,C,C,C,C,G,G,G,C,C,G,G,G,C,C,G,G,G,G,G,G,C,C,G,C,C,G,G,G,G,G,H,C,G,G,G,G,C,G,G,G,G,G,G,G,G,G,G,G,G,G,G,G,G,G,G,G,G,G,G,G,G,G,G,G,G,G,G,G,G,G,G,G,G,G,G,G,G,G,G,G,G,G,G,G,G,G,G,G,G,G,G,G,G,G,G,G,G,G,G,G,G,G,G,G,G,G,G,G,G,G,G,G,G,G,G,G,G,G,G,G,G,G,G,G,G,G,G,G,G,G,C,G,G,C,G,C,C,C,G,G,G,G,G,H,C,C,G,G,G,G,G,G,G,G,G,G,G,G,G,G,G,C,C,C,C,G,G,G,G,G,G,G,G,G,G,G,G,G,C,G,G,C,,G,C,G,C,C,C,G,C,G,C,G,G,G,C,C,C,G,C,G,C,G,C,G,G,C,G,G,C,C,C,C,C,C,G,G,C,G,C,C,C,G,C,C,C,C,C,C,,
3,44220623,"rs30060733","C/T","","3:44-47",C,C,C,C,C,,C,T,C,C,C,T,C,C,T,T,T,T,T,T,T,C,C,C,T,T,C,C,C,T,T,C,C,C,C,C,C,,T,C,T,T,C,C,C,C,C,H,T,C,C,C,C,T,C,C,C,C,C,C,C,C,C,C,C,C,C,C,C,C,C,C,C,C,C,C,C,C,C,C,C,C,C,C,C,C,C,C,C,C,C,C,C,C,C,C,C,C,C,C,C,C,C,C,C,C,C,C,C,C,C,C,C,C,C,C,C,C,C,C,C,C,C,C,C,C,C,C,C,C,C,C,C,C,C,C,C,C,C,C,C,C,C,C,C,C,C,T,C,C,T,C,T,T,T,C,C,C,C,C,H,T,T,C,C,C,C,C,C,,C,C,C,C,C,C,C,C,T,T,T,T,C,C,C,C,C,C,C,C,C,C,C,C,C,T,C,C,T,T,C,,C,T,T,T,C,T,C,T,C,C,C,,,,C,,C,T,C,T,C,C,,C,C,T,T,T,,C,T,C,C,T,C,C,T,T,C,T,T,T,T,T,T,T,
3,44228922,"rs31600880","A/G","","3:44-47",G,G,G,G,G,G,G,A,G,G,G,A,G,G,A,A,A,A,A,A,A,G,G,G,A,A,G,G,G,A,A,G,G,G,G,G,G,A,A,G,A,A,G,G,G,G,G,H,A,G,G,G,G,A,G,G,G,G,G,G,G,G,G,G,G,G,G,G,G,G,G,G,G,G,G,G,G,G,G,G,G,G,G,G,G,G,G,G,G,G,G,G,G,G,G,G,G,G,G,G,G,G,G,G,G,G,G,G,G,G,G,G,G,G,G,G,G,G,G,G,G,G,G,G,G,G,G,G,G,G,G,G,G,G,G,G,G,G,G,G,G,G,G,G,G,G,G,A,G,G,A,G,A,A,A,G,G,G,G,G,H,A,A,G,G,G,G,G,G,G,G,G,G,G,G,G,G,G,A,,A,,G,G,G,G,G,G,G,G,G,G,G,G,G,G,G,G,A,,G,,G,,,G,G,G,G,A,G,G,G,G,,G,G,G,G,A,,A,G,G,,G,G,A,A,A,G,,,G,G,A,G,G,G,A,G,A,G,A,G,A,A,A,
3,44232486,"rs31563974","C/T","","3:44-47",T,T,T,T,T,T,T,C,T,T,T,C,T,T,C,C,C,C,C,C,C,T,T,T,C,C,T,T,T,C,C,T,T,T,,T,T,C,C,T,C,C,T,T,T,T,T,H,C,T,T,T,T,C,T,T,T,T,T,T,T,T,T,T,T,T,T,T,T,T,T,T,T,T,T,T,T,T,T,T,T,T,T,T,T,T,T,T,T,T,T,T,T,T,T,T,T,T,T,T,T,T,T,T,T,T,T,T,T,T,T,T,T,T,T,T,T,T,T,T,T,T,T,T,T,T,T,T,T,T,T,T,T,T,T,T,T,T,T,T,T,T,T,T,T,T,T,C,T,T,C,T,C,C,C,T,T,T,T,T,H,C,C,T,T,T,T,T,T,T,T,T,T,T,T,T,T,T,,T,C,C,T,T,T,T,T,T,T,T,T,T,T,T,T,T,T,T,C,,T,C,T,C,C,T,T,T,T,C,T,T,T,T,T,T,T,T,T,C,,C,T,,T,T,,C,C,C,T,,C,T,,C,T,T,T,C,T,C,T,C,T,C,C,C,
3,44235909,"rs30840847","C/T","","3:44-47",C,C,C,C,C,C,C,T,C,C,C,T,C,C,T,T,T,T,T,T,T,C,C,C,T,T,C,C,C,T,T,C,C,C,C,C,C,T,T,C,T,T,C,C,C,C,C,H,T,C,C,C,C,T,C,C,C,C,C,C,C,C,C,C,C,C,C,C,C,C,C,C,C,C,C,C,C,C,C,C,C,C,C,C,C,C,C,C,C,C,C,C,C,C,C,C,C,C,C,C,C,C,C,C,C,C,C,C,C,C,C,C,C,C,C,C,C,C,C,C,C,C,C,C,C,C,C,C,C,C,C,C,C,C,C,C,C,C,C,C,C,C,C,C,C,C,C,T,C,C,T,C,T,T,T,C,C,C,C,C,H,T,T,C,C,C,C,C,C,C,C,C,C,C,C,C,C,C,,C,T,T,C,C,C,C,C,C,C,C,C,C,C,C,C,T,C,C,T,T,C,,C,,,C,C,C,C,T,C,C,C,T,,C,C,T,C,T,C,T,C,C,,C,C,,,T,,,T,C,C,T,C,C,C,T,C,T,C,T,C,T,T,,
3,44256590,"rs30907378","C/T","","3:44-47",T,T,T,T,T,T,T,C,T,T,T,C,T,T,C,C,C,C,C,C,C,T,T,T,C,C,T,T,T,C,C,T,T,T,T,T,T,C,C,T,C,C,T,T,T,T,T,H,C,T,T,T,T,C,T,T,T,T,T,T,T,T,T,T,T,T,T,T,T,T,T,T,T,T,T,T,T,T,T,T,T,T,T,T,T,T,T,T,T,T,T,T,T,T,T,T,T,T,T,T,T,T,T,T,T,T,T,T,T,T,T,T,T,T,T,T,T,T,T,T,T,T,T,T,T,T,T,T,T,T,T,T,T,T,T,T,T,T,T,T,T,T,T,T,T,T,T,C,T,T,C,T,C,C,C,T,T,T,T,T,H,C,C,T,T,T,T,T,T,T,T,T,T,T,T,T,T,T,C,T,C,C,T,T,T,T,T,T,T,T,T,T,T,T,T,T,T,T,C,C,T,C,T,C,C,C,T,T,T,C,T,T,T,T,T,T,T,T,T,C,,C,T,T,T,T,,C,C,C,T,T,C,T,T,C,T,,T,C,T,C,,C,T,C,C,C,
3,44269903,"rs30757760","C/G","","3:44-47",G,G,G,G,G,G,G,C,G,G,G,C,G,G,C,C,C,C,C,C,C,G,G,G,C,C,G,G,G,C,C,G,G,G,G,G,G,G,C,G,C,C,G,G,G,G,G,H,C,G,G,G,G,C,G,G,G,G,G,G,G,G,G,G,G,G,G,G,G,G,G,G,G,G,G,G,G,G,G,G,G,G,G,G,G,G,G,G,G,G,G,G,G,G,G,G,G,G,G,G,G,G,G,G,G,G,G,G,G,G,G,G,G,G,G,G,G,G,G,G,G,G,G,G,G,G,G,G,G,G,G,G,G,G,G,G,G,G,G,G,G,G,G,G,G,G,G,C,G,G,C,G,C,C,C,G,G,G,G,G,H,C,C,G,G,G,G,G,G,G,G,G,G,G,G,G,G,G,C,G,C,G,G,G,G,G,G,G,G,G,G,G,G,G,G,G,G,G,G,G,G,G,G,C,G,G,G,G,G,C,G,G,G,G,G,G,G,G,G,G,G,C,G,G,G,G,G,C,C,C,,,C,G,G,G,G,G,G,G,G,G,G,C,G,G,C,C,
3,44291676,"rs31443426","A/T","","3:44-47",T,T,T,T,T,T,T,A,T,T,T,A,T,T,A,A,A,A,A,A,A,T,T,T,A,A,T,T,T,A,A,T,T,T,,,T,A,A,T,A,A,T,T,T,T,T,H,A,T,T,T,T,A,T,T,T,T,T,T,T,T,T,T,T,T,T,T,T,T,T,T,T,T,T,T,T,T,T,T,T,T,T,T,T,T,T,T,T,T,T,T,T,T,T,T,T,T,T,T,T,T,T,T,T,T,T,T,T,T,T,T,T,T,T,T,T,T,T,T,T,T,T,T,T,T,T,T,T,T,T,T,T,T,T,T,T,T,T,T,T,T,T,T,T,T,T,A,T,T,A,T,A,A,A,T,T,T,T,T,H,A,A,T,T,T,T,T,T,T,T,T,T,T,T,T,T,T,A,T,A,A,T,T,T,T,T,T,T,T,T,T,T,T,T,,T,T,A,A,T,A,T,A,A,T,T,T,T,A,T,T,T,T,T,T,T,,T,A,T,A,T,,T,T,,A,A,A,T,,A,T,T,A,T,A,T,A,,A,,A,T,A,A,A,
3,44293214,"rs30849439","A/T","","3:44-47",A,A,A,A,A,,A,T,A,A,A,T,A,A,T,T,T,T,T,T,T,A,A,A,T,T,A,A,A,T,T,A,A,A,A,A,A,T,T,A,T,T,A,A,A,A,A,H,T,A,A,A,A,T,A,A,A,A,A,A,A,A,A,A,A,A,A,A,A,A,A,A,A,A,A,A,A,A,A,A,A,A,A,A,A,A,A,A,A,A,A,A,A,A,A,A,A,A,A,A,A,A,A,A,A,A,A,A,A,A,A,A,A,A,A,A,A,A,A,A,A,A,A,A,A,A,A,A,A,A,A,A,A,A,A,A,A,A,A,A,A,A,A,A,A,A,A,T,A,A,T,A,T,T,T,A,A,A,A,A,H,T,T,A,A,A,A,A,A,A,A,A,A,A,A,A,A,A,T,T,T,T,A,A,A,A,A,A,A,A,A,A,A,A,A,,A,A,T,T,A,T,A,T,T,T,A,T,A,T,A,A,A,T,T,T,A,T,,,A,T,A,A,T,A,A,T,T,T,T,,T,A,A,T,A,,T,T,A,T,T,T,T,T,T,T,
3,44355584,"rs30450245","G/T","","3:44-47",G,G,G,G,G,G,G,T,G,G,G,T,G,G,T,T,T,T,T,T,T,G,G,G,T,T,G,G,G,T,T,G,G,G,G,G,G,T,T,G,T,T,G,G,G,G,G,H,T,G,G,G,G,T,G,G,G,G,G,G,G,G,G,G,G,G,G,G,G,G,G,G,G,G,G,G,G,G,G,G,G,G,G,G,G,G,G,G,G,G,G,G,G,G,G,G,G,G,G,G,G,G,G,G,G,G,G,G,G,G,G,G,G,G,G,G,G,G,G,G,G,G,G,G,G,G,G,G,G,G,G,G,G,G,G,G,G,G,G,G,G,G,G,G,G,G,G,T,G,G,T,G,T,T,T,G,G,G,G,G,H,T,T,G,G,G,G,G,G,G,G,G,G,G,G,G,G,G,T,T,T,T,G,G,G,G,G,G,G,G,G,G,G,G,G,T,G,G,T,T,G,T,G,T,T,G,G,T,G,T,G,G,G,T,T,T,G,T,G,T,G,T,G,G,T,G,G,T,T,T,T,,T,G,G,T,G,T,G,T,G,T,T,T,G,T,T,,
3,44359726,"rs6333517","G/T","","3:44-47",T,T,T,T,T,T,T,T,T,T,T,T,T,T,T,T,T,T,T,T,T,T,T,T,T,T,T,T,T,T,T,T,T,T,T,T,T,T,T,T,T,T,T,T,T,T,T,T,T,T,T,T,T,T,T,T,T,T,T,T,T,T,T,T,T,T,T,T,T,T,T,T,T,T,T,T,T,T,T,T,T,T,T,T,T,T,T,T,T,T,T,T,T,T,T,T,T,T,T,T,T,T,T,T,T,T,T,T,T,T,T,T,T,T,T,T,T,T,T,T,T,T,T,T,T,T,T,T,T,T,T,T,T,T,T,T,T,T,T,T,T,T,T,T,T,T,T,T,T,T,T,T,T,T,T,T,T,T,T,T,T,T,T,T,T,T,T,T,T,T,T,T,T,T,T,T,T,T,T,T,T,T,T,T,T,T,T,T,T,T,T,T,T,T,T,G,T,T,T,T,T,T,T,T,T,T,T,T,T,T,T,T,T,T,T,T,T,T,T,T,T,T,T,T,T,T,T,T,T,T,,T,T,T,T,T,T,,T,T,T,T,,T,T,T,T,,
3,44391470,"rs30856982","A/C","","3:44-47",A,A,A,A,A,A,A,C,A,A,A,C,A,A,C,C,C,C,C,C,C,A,A,A,C,C,A,A,A,C,C,A,A,A,A,A,A,C,C,A,C,C,A,A,A,A,A,H,C,A,A,A,A,C,A,A,A,A,A,A,A,A,A,A,A,A,A,A,A,A,A,A,A,A,A,A,A,A,A,A,A,A,A,A,A,A,A,A,A,A,A,A,A,A,A,A,A,A,A,A,A,A,A,A,A,A,A,A,A,A,A,A,A,A,A,A,A,A,A,A,A,A,A,A,A,A,A,A,A,A,A,A,A,A,A,A,A,A,A,A,A,A,A,A,A,A,A,C,A,A,C,A,C,C,C,A,A,A,A,A,H,C,C,A,A,A,A,A,A,A,A,A,A,A,A,A,A,A,C,C,C,C,A,A,A,A,A,A,A,A,A,A,A,A,A,C,A,A,C,C,A,C,A,C,C,C,A,C,A,C,A,A,A,C,C,C,A,C,A,C,A,C,A,A,C,A,A,C,C,C,C,C,C,A,A,C,A,C,C,C,A,C,C,C,C,C,C,C,
3,44409410,"rs30941608","G/T","","3:44-47",G,G,G,G,G,G,G,T,G,G,G,T,G,G,T,T,T,T,T,T,T,G,G,G,T,T,G,G,G,T,T,G,G,G,G,G,G,T,T,G,T,T,G,G,G,G,G,H,T,G,G,G,G,T,G,G,G,G,G,G,G,G,G,G,G,G,G,G,G,G,G,G,G,G,G,G,G,G,G,G,G,G,G,G,G,G,G,G,G,G,G,G,G,G,G,G,G,G,G,G,G,G,G,G,G,G,G,G,G,G,G,G,G,G,G,G,G,G,G,G,G,G,G,G,G,G,G,G,G,G,G,G,G,G,G,G,G,G,G,G,G,G,G,G,G,G,G,T,G,G,T,G,T,T,T,G,G,G,G,G,H,T,T,G,G,G,G,G,G,G,G,G,G,G,G,G,G,G,T,G,T,T,G,G,G,G,G,G,G,G,G,G,G,G,G,G,G,G,T,,G,T,G,T,T,G,G,G,G,T,G,G,G,T,G,G,G,G,G,T,G,T,G,G,G,G,G,T,T,T,T,G,,G,G,T,G,G,G,T,G,T,G,T,G,,,T,
3,44426806,"rs6243798","A/G","","3:44-47",A,A,A,A,,,A,G,A,A,A,G,A,A,G,G,G,G,G,G,G,A,A,A,G,G,A,A,A,G,G,A,A,A,,,A,G,G,A,G,G,A,A,A,A,A,H,G,A,A,A,A,G,A,A,A,A,A,A,A,A,A,A,A,A,A,A,A,A,A,A,A,A,A,A,A,A,A,A,A,A,A,A,A,A,A,A,A,A,A,A,A,A,A,A,A,A,A,A,A,A,A,A,A,A,A,A,A,A,A,A,A,A,A,A,A,A,A,A,A,A,A,A,A,A,A,A,A,A,A,A,A,A,A,A,A,A,A,A,A,A,A,A,A,A,A,G,A,A,G,A,G,G,G,A,A,A,A,A,H,G,G,A,A,A,,A,A,,A,,,,A,A,A,A,G,G,G,,A,A,A,A,A,A,A,A,A,A,A,A,A,G,A,A,G,G,A,G,A,G,G,G,A,G,A,G,A,A,A,G,G,G,,G,A,G,,G,,,G,A,,G,G,G,G,G,G,A,A,G,A,G,G,G,A,G,G,G,G,G,G,G,
3,44452925,"rs30261072","A/G","","3:44-47",A,A,A,A,A,A,A,G,A,A,A,G,A,A,G,G,G,G,G,G,G,A,A,A,G,G,A,A,A,G,G,A,A,A,A,A,A,G,G,A,G,G,A,A,A,A,A,H,G,A,A,A,A,G,A,A,A,A,A,A,A,A,A,A,A,A,A,A,A,A,A,A,A,A,A,A,A,A,A,A,A,A,A,A,A,A,A,A,A,A,A,A,A,A,A,A,A,A,A,A,A,A,A,A,A,A,A,A,A,A,A,A,A,A,A,A,A,A,A,A,A,A,A,A,A,A,A,A,A,A,A,A,A,A,A,A,A,A,A,A,A,A,A,A,A,A,A,G,A,A,G,A,G,G,G,A,A,A,A,A,H,G,G,A,A,A,A,A,A,A,A,A,A,A,A,A,A,A,G,G,G,G,A,A,A,A,A,A,A,A,A,A,A,A,A,G,A,A,G,G,A,G,A,G,G,G,A,G,A,G,A,A,A,G,G,G,A,G,A,G,A,G,A,A,G,A,A,G,G,G,G,G,G,A,A,G,A,G,A,G,,G,G,G,A,G,G,G,
3,44493905,"rs13477086","C/T","","3:44-47",,C,,,C,,C,T,C,C,C,T,C,C,T,T,T,T,T,T,T,C,C,C,T,T,C,C,C,T,T,C,C,C,C,C,C,T,T,C,T,T,C,C,C,C,C,H,T,C,C,C,C,T,C,C,C,C,C,C,C,C,C,C,C,C,C,C,C,C,C,C,C,C,C,C,C,C,C,C,C,C,C,C,C,C,C,C,C,C,C,C,C,C,C,C,C,C,C,C,C,C,C,C,C,C,C,C,C,C,C,C,C,C,C,C,C,C,C,C,C,C,C,C,C,C,C,C,C,C,C,C,C,C,C,C,C,C,C,C,C,C,C,C,C,C,C,T,C,C,T,C,T,T,T,C,C,C,C,C,H,T,T,C,,C,,,,,,,,,,C,C,C,T,C,T,T,C,C,C,C,C,C,C,C,C,C,C,C,C,,C,C,,T,C,T,,T,T,T,C,,C,T,C,C,C,,,,C,,C,T,C,,,C,,,C,T,T,T,,T,,C,C,T,C,,T,T,C,,,T,T,,T,T,
3,44496446,"rs31229086","A/C","","3:44-47",C,C,C,C,C,C,C,A,C,C,C,A,C,C,A,A,A,A,A,A,A,C,C,C,A,A,C,C,C,A,A,C,,,C,,C,A,A,C,A,A,C,C,C,C,C,H,A,C,C,C,C,A,C,C,C,C,C,C,C,C,C,C,C,C,C,C,C,C,C,C,C,C,C,C,C,C,C,C,C,C,C,C,C,C,C,C,C,C,C,C,C,C,C,C,C,C,C,C,C,C,C,C,C,C,C,C,C,C,C,C,C,C,C,C,C,C,C,C,C,C,C,C,C,C,C,C,C,C,C,C,C,C,C,C,C,C,C,C,C,C,C,C,C,C,C,A,C,C,A,C,A,A,A,C,C,C,C,C,H,A,A,,,C,C,C,C,C,C,C,C,C,C,C,C,C,A,,A,C,C,C,C,C,C,C,C,C,C,C,C,C,C,,C,C,A,A,C,A,,A,A,C,C,,C,A,C,C,C,C,A,,,,C,A,C,A,,,,C,,A,A,A,,C,A,C,,A,C,,,A,C,,A,A,,A,A,C,
3,44516611,"rs31528277","G/T","","3:44-47",T,T,T,T,T,T,T,G,T,T,T,G,T,T,G,G,G,G,G,G,G,T,T,T,G,G,T,T,T,G,G,T,T,T,T,,T,G,G,T,G,G,T,T,T,T,T,H,G,T,T,T,T,G,T,T,T,T,T,T,T,T,T,T,T,T,T,T,T,T,T,T,T,T,T,T,T,T,T,T,T,T,T,T,T,T,T,T,T,T,T,T,T,T,T,T,T,T,T,T,T,T,T,T,T,T,T,T,T,T,T,T,T,T,T,T,T,T,T,T,T,T,T,T,T,T,T,T,T,T,T,T,T,T,T,T,T,T,T,T,T,T,T,T,T,T,T,G,T,T,G,T,G,G,G,T,T,T,T,T,H,G,G,T,T,T,T,T,T,T,T,T,T,T,T,T,T,T,G,G,G,G,T,T,T,T,T,T,T,T,T,T,T,T,T,G,T,T,G,G,T,G,T,G,G,T,,G,T,G,T,T,T,G,G,G,,G,T,G,,G,,,G,T,T,G,G,G,G,G,G,T,,G,T,G,G,G,,G,G,G,G,G,G,G,
3,44517190,"rs3667394","A/G","","3:44-47",A,A,A,A,A,A,A,G,A,A,A,G,A,A,G,G,G,G,G,G,G,A,A,A,G,G,A,A,A,G,G,A,,A,,,A,G,G,A,G,G,A,A,A,A,A,H,G,A,A,A,A,G,A,A,,,,A,,A,A,,,,A,,A,A,A,A,,,A,,A,A,,,,,,,A,A,A,,A,A,,,,,,,A,,,,A,,,,A,,A,,A,,,A,A,A,A,A,A,,,,A,A,A,A,A,A,A,,,,A,,A,,A,,,A,,,,A,A,,A,A,A,G,A,A,G,A,G,G,G,A,A,A,A,A,H,G,G,A,A,A,A,A,A,A,A,A,A,A,A,A,A,A,G,A,G,G,A,A,A,A,A,A,A,A,A,A,A,A,A,,A,,G,G,A,G,,G,G,A,A,,A,G,A,A,A,G,G,,,,A,G,A,G,A,A,G,A,,G,G,G,,G,G,A,,G,A,,A,G,,G,,G,A,G,G,G,
3,44518566,"rs30803110","A/G","","3:44-47",G,G,G,G,G,G,G,A,G,G,G,A,G,G,A,A,A,A,A,A,A,G,G,G,A,A,G,G,G,A,A,G,G,G,G,,G,A,A,G,A,A,G,G,G,G,G,H,A,G,G,G,G,A,G,G,G,G,G,G,G,G,G,G,G,G,G,G,G,G,G,G,G,G,G,G,G,G,G,G,G,G,G,G,G,G,G,G,G,G,G,G,G,G,G,G,G,G,G,G,G,G,G,G,G,G,G,G,G,G,G,G,G,G,G,G,G,G,G,G,G,G,G,G,G,G,G,G,G,G,G,G,G,G,G,G,G,G,G,G,G,G,G,G,G,G,G,A,G,G,A,G,A,A,A,G,G,G,G,G,H,A,A,G,G,G,G,G,G,G,G,G,G,G,G,G,G,G,A,G,A,A,G,G,G,G,G,G,G,G,G,G,G,G,G,,G,G,A,A,G,A,G,A,A,G,G,,G,A,G,G,G,A,,,G,,G,A,G,A,G,G,G,G,G,A,A,A,,A,A,G,G,A,G,A,A,A,G,A,A,A,A,A,A,A,
3,44643848,"rs31401451","C/T","","3:44-47",C,C,C,C,C,C,C,T,C,C,C,T,C,C,T,T,T,T,T,T,T,C,C,C,T,T,C,C,C,T,T,C,C,C,C,C,C,T,T,C,T,T,C,C,C,C,C,H,T,C,C,C,C,T,C,C,C,C,C,C,C,C,C,C,C,C,C,C,C,C,C,C,C,C,C,C,C,C,C,C,C,C,C,C,C,C,C,C,C,C,C,C,C,C,C,C,C,C,C,C,C,C,C,C,C,C,C,C,C,C,C,C,C,C,C,C,C,C,C,C,C,C,C,C,C,C,C,C,C,C,C,C,C,C,C,C,C,C,C,C,C,C,C,C,C,C,C,T,C,C,T,C,T,T,T,C,C,C,C,C,H,T,T,C,C,C,C,C,C,C,C,C,C,C,C,C,C,C,,C,T,C,C,C,C,C,C,C,C,C,C,C,C,C,C,C,C,C,T,,C,T,C,T,T,C,C,C,C,C,C,C,C,C,C,C,C,C,C,T,C,T,C,C,C,C,C,T,C,T,C,C,T,C,C,T,C,C,C,T,C,C,,T,C,T,C,C,
3,44712477,"rs6248252","A/T","","3:44-47",,A,,,A,,A,T,A,A,A,T,A,A,T,T,T,T,T,T,T,A,A,A,T,T,A,A,A,T,T,A,A,A,A,A,A,T,T,A,T,T,A,A,A,A,A,H,T,A,A,A,A,T,A,A,A,A,A,A,A,A,A,A,A,A,A,A,A,A,A,A,A,A,A,A,A,A,A,A,A,A,A,A,A,A,A,A,A,A,A,A,A,A,A,A,A,A,A,A,A,A,A,A,A,A,A,A,A,A,A,A,A,A,A,A,A,A,A,A,A,A,A,A,A,A,A,A,A,A,A,A,A,A,A,A,A,A,A,A,A,A,A,A,A,A,A,T,A,A,T,A,T,T,T,A,A,A,A,A,H,T,T,A,,A,,,,,,,,,,A,A,A,T,T,T,T,A,A,A,A,A,A,A,A,A,A,A,A,A,,A,A,,A,A,T,,T,T,T,A,,A,T,A,A,A,,T,,A,T,A,A,A,,,A,T,,A,T,T,T,,T,,A,A,T,A,,T,T,A,,T,T,T,,A,T,
3,44716737,"rs30657849","C/T","","3:44-47",C,C,C,C,C,C,C,T,C,C,C,T,C,C,T,T,T,T,T,T,T,C,C,C,T,T,C,C,C,T,T,C,C,C,C,C,C,T,T,C,T,T,C,C,C,C,C,H,T,C,C,C,C,T,C,C,C,C,C,C,C,C,C,C,C,C,C,C,C,C,C,C,C,C,C,C,C,C,C,C,C,C,C,C,C,C,C,C,C,C,C,C,C,C,C,C,C,C,C,C,C,C,C,C,C,C,C,C,C,C,C,C,C,C,C,C,C,C,C,C,C,C,C,C,C,C,C,C,C,C,C,C,C,C,C,C,C,C,C,C,C,C,C,C,C,C,C,T,C,C,T,C,T,T,T,C,C,C,C,C,H,T,T,C,C,C,C,C,C,C,C,C,C,C,C,C,C,C,T,T,T,T,C,C,C,C,C,C,C,C,C,C,C,C,C,T,C,C,C,C,C,T,C,T,T,T,C,T,C,T,C,C,C,T,T,T,C,T,C,C,C,T,C,C,T,C,C,T,T,T,T,T,T,C,C,T,C,T,T,T,C,T,T,T,T,C,T,T,
3,44716764,"rs30158154","A/C","","3:44-47",C,C,C,C,C,C,C,A,C,C,C,A,C,C,A,A,A,A,A,A,A,C,C,C,A,A,C,C,C,A,A,C,C,C,C,C,C,A,A,C,A,A,C,C,C,C,C,H,A,C,C,C,C,A,C,C,C,C,C,C,C,C,C,C,C,C,C,C,C,C,C,C,C,C,C,C,C,C,C,C,C,C,C,C,C,C,C,C,C,C,C,C,C,C,C,C,C,C,C,C,C,C,C,C,C,C,C,C,C,C,C,C,C,C,C,C,C,C,C,C,C,C,C,C,C,C,C,C,C,C,C,C,C,C,C,C,C,C,C,C,C,C,C,C,C,C,C,A,C,C,A,C,A,A,A,C,C,C,C,C,H,A,A,C,C,C,C,C,C,C,C,C,C,C,C,C,C,C,,A,A,A,C,C,C,C,C,C,C,C,C,C,C,C,C,A,C,C,C,C,C,A,C,A,A,A,C,A,C,A,C,C,C,A,A,A,C,A,C,C,C,A,C,C,A,C,C,A,A,A,A,,A,C,C,A,C,A,A,A,C,A,A,A,A,C,A,A,