chr,bp38,rs,observed,dbsnp142annot,requested,"C57BL/6J::7","129P2/OlaHsd::834","129S1/SvImJ::3","129S5SvEv<Brd>::62","AKR/J::15","A/J::4","BALB/cJ::5","BTBR T<+> Itpr3<tf>/J::1","BUB/BnJ::24","C3H/HeH::843","C3H/HeJ::6","C57BL/10J::38","C57BL/6NJ::182","C57BR/cdJ::32","C57L/J::37","C58/J::28","CAST/EiJ::2","CBA/J::16","DBA/1J::65","DBA/2J::8","FVB/NJ::9","I/LnJ::30","KK/HlJ::18","LEWES/EiJ::88","LP/J::10","MOLF/EiJ::40","NOD/ShiLtJ::13","NZB/BlNJ::11","NZO/HlLtJ::122","NZW/LacJ::36","PWK/PhJ::217","RF/J::74","SEA/GnJ::29","SPRET/EiJ::39","ST/bJ::69","WSB/EiJ::42","ZALENDE/EiJ::80",
3,121709013,"rs30258311","C/T","","3:121709000-121835200",C,C,C,C,C,C,C,C,C,C,C,C,C,C,C,C,T,C,C,C,C,C,C,C,C,C,C,C,C,C,C,C,C,C,C,C,C,
3,121709023,"rs260497331","C/T","","3:121709000-121835200",C,C,C,C,C,C,C,C,C,C,C,C,C,C,C,C,C,C,C,C,C,C,C,C,C,C,C,C,C,C,C,C,C,T,C,C,C,
3,121709101,"rs244864076","indel","","3:121709000-121835200",0,1,1,,,3,,,,,,0,3,,,,,,,,,,0,1,1,,,,,,3,,,,,,,
3,121709102,,,"","3:121709000-121835200",C,C,C,C,C,C,C,C,C,C,C,C,C,C,C,C,C,C,C,C,C,C,C,C,C,C,C,C,C,C,,C,C,C,C,C,C,
3,121709111,"rs248839022","indel","","3:121709000-121835200",0,,,,,,,,,,,,,,,,1,,1,1,,,,,,1,,,,,,,,,,,,
3,121709113,"rs237211299","indel","","3:121709000-121835200",0,,,,,,,,,,,,,,,,,,,,,,,,,,,,,,,,,1,,,,
3,121709134,"rs218540596","C/T","","3:121709000-121835200",T,T,T,T,T,T,T,T,T,T,T,T,T,T,T,T,C,T,T,T,T,T,T,T,T,T,T,T,T,T,T,T,T,T,T,T,T,
3,121709183,"rs233527006","C/T","","3:121709000-121835200",T,T,T,T,T,T,T,T,T,T,T,T,T,T,T,T,T,T,T,T,T,T,T,T,T,T,T,T,T,T,T,T,T,C,T,T,T,
3,121709199,"rs245615235","A/G","","3:121709000-121835200",G,G,G,G,G,G,G,G,G,G,G,G,G,G,G,G,G,G,G,G,G,G,G,G,G,G,G,G,G,G,G,G,G,A,G,G,G,
3,121709226,"rs214434059","A/G","","3:121709000-121835200",G,G,G,G,G,G,G,G,G,G,G,G,G,G,G,G,G,G,G,G,G,G,G,G,G,G,G,G,G,G,G,G,G,A,G,G,G,
3,121709273,"rs231484777","A/G","","3:121709000-121835200",G,G,G,G,G,G,G,G,G,G,G,G,G,G,G,G,G,G,G,G,G,G,G,G,G,G,G,G,G,G,G,G,G,A,G,G,G,
3,121709314,"rs50457509","C/T","","3:121709000-121835200",C,T,T,T,C,C,C,C,C,C,C,C,C,C,C,C,C,C,C,C,C,C,C,T,T,C,C,C,C,C,C,C,C,C,C,C,T,
3,121709358,"rs212516188","A/G","","3:121709000-121835200",G,G,G,G,G,G,G,G,G,G,G,G,G,G,G,G,G,G,G,G,G,G,G,G,G,G,G,G,G,G,G,G,G,A,G,G,G,
3,121709411,"rs51048931","C/T","","3:121709000-121835200",T,C,C,C,T,T,T,T,T,T,T,T,T,T,T,T,T,T,T,T,T,T,T,C,C,T,T,T,T,T,T,T,C,C,T,C,C,
3,121709412,"rs264132801","A/G","","3:121709000-121835200",G,G,G,G,G,G,G,G,G,G,G,G,G,G,G,G,G,G,G,G,G,G,G,G,G,G,G,G,G,G,G,G,A,G,G,A,G,
3,121709423,"rs30259304","A/G","","3:121709000-121835200",G,G,G,G,G,G,G,G,G,G,G,G,G,G,G,G,G,G,G,G,G,G,G,G,G,G,G,G,G,G,A,G,G,G,G,G,G,
3,121709446,"rs30259307","A/C","","3:121709000-121835200",C,A,A,A,C,C,C,C,C,C,C,C,C,C,C,C,C,C,C,C,C,C,C,A,A,C,C,C,C,C,C,C,C,C,C,C,A,
3,121709489,"rs252809880","C/T","","3:121709000-121835200",C,C,C,C,C,C,C,C,C,C,C,C,C,C,C,C,C,C,C,C,C,C,C,C,C,C,C,C,C,C,C,C,C,T,C,C,C,
3,121709496,"rs219972672","C/T","","3:121709000-121835200",T,T,T,T,T,T,T,T,T,T,T,T,T,T,T,T,T,T,T,T,T,T,T,T,T,T,T,T,T,T,T,T,T,C,T,T,T,
3,121709513,"rs30259310","C/T","","3:121709000-121835200",C,C,C,C,C,C,C,C,C,C,C,C,C,C,C,C,C,C,T,T,C,C,C,C,C,T,C,C,C,C,T,C,C,C,C,C,C,
3,121709526,"rs261820608","A/G","","3:121709000-121835200",G,G,G,G,G,G,G,G,G,G,G,G,G,G,G,G,G,G,G,G,G,G,G,G,G,G,G,G,G,G,G,G,G,A,G,G,G,
3,121709541,"rs219855615","A/G","","3:121709000-121835200",G,G,G,G,G,G,G,G,G,G,G,G,G,G,G,G,G,G,G,G,G,G,G,G,G,G,G,G,G,G,G,G,G,A,G,G,G,
3,121709604,"rs47406421","A/C","","3:121709000-121835200",A,A,A,A,A,A,A,A,A,A,A,A,A,A,A,A,A,A,C,C,A,A,A,A,A,C,A,A,A,A,A,A,A,A,A,A,A,
3,121709614,,,"","3:121709000-121835200",G,G,G,G,G,G,G,G,G,G,G,G,G,G,G,G,T,G,G,G,G,G,G,G,G,G,G,G,G,G,G,G,G,G,G,G,G,
3,121709615,"rs251772585","indel","","3:121709000-121835200",0,,,,,,,,,,,,,,,,1,,,,,,,,,,,,,,,,,,,,,
3,121709656,"rs48944109","A/G","","3:121709000-121835200",G,A,A,A,G,G,G,G,G,G,G,G,G,G,G,G,A,G,A,A,G,G,G,A,A,A,G,G,G,G,A,G,A,G,G,A,A,
3,121709704,"rs30260236","A/T","","3:121709000-121835200",T,A,A,A,T,T,T,T,T,T,T,T,T,T,T,T,T,T,T,T,T,T,T,A,A,T,T,T,T,T,T,T,A,T,T,A,A,
3,121709752,"rs30260239","A/G","","3:121709000-121835200",G,G,G,G,G,G,G,G,G,G,G,G,G,G,G,G,G,G,A,A,G,G,G,G,G,A,G,G,G,G,A,G,A,G,G,A,G,
3,121709814,"rs50461373","A/C","","3:121709000-121835200",C,C,C,C,C,C,C,C,C,C,C,C,C,C,C,C,C,C,A,A,C,C,C,C,C,A,C,C,C,C,C,C,C,C,C,C,C,
3,121709823,"rs225363397","A/G","","3:121709000-121835200",A,A,A,A,A,A,A,A,A,A,A,A,A,A,A,A,A,A,A,A,A,A,A,A,A,A,A,A,A,A,A,A,G,A,A,G,A,
3,121709874,"rs243173711","C/T","","3:121709000-121835200",T,T,T,T,T,T,T,T,T,T,T,T,T,T,T,T,T,T,T,T,T,T,T,T,T,T,T,T,T,T,T,T,T,C,T,T,T,
3,121709879,"rs212126847","A/G","","3:121709000-121835200",A,A,A,A,A,A,A,A,A,A,A,A,A,A,A,A,A,A,A,A,A,A,A,A,A,A,A,A,A,A,A,A,G,A,A,G,A,
3,121710055,"rs243224487","A/T","","3:121709000-121835200",A,A,A,A,A,A,A,A,A,A,A,A,A,A,A,A,A,A,A,A,A,A,A,A,A,A,A,A,A,A,A,A,A,T,A,A,A,
3,121710074,"rs254102745","A/G","","3:121709000-121835200",G,G,G,G,G,G,G,G,G,G,G,G,G,G,G,G,G,G,G,G,G,G,G,G,G,G,G,G,G,G,G,G,G,A,G,G,G,
3,121710099,"rs217902057","A/T","","3:121709000-121835200",A,A,A,A,A,A,A,A,A,A,A,A,A,A,A,A,A,A,A,A,A,A,A,A,A,A,A,A,A,A,A,A,T,A,A,T,A,
3,121710151,"rs234700631","A/G","","3:121709000-121835200",G,G,G,G,G,G,G,G,G,G,G,G,G,G,G,G,G,G,G,G,G,G,G,G,G,G,G,G,G,G,G,G,G,A,G,G,G,
3,121710182,"rs46790499","A/G","","3:121709000-121835200",G,G,G,G,G,G,G,G,G,G,G,G,G,G,G,G,G,G,A,A,G,G,G,G,G,A,G,G,G,G,A,G,G,G,G,G,G,
3,121710195,"rs220288155","A/G","","3:121709000-121835200",A,A,A,A,A,A,A,A,A,A,A,A,A,A,A,A,A,A,A,A,A,A,A,A,A,A,A,A,A,A,A,A,A,G,A,A,A,
3,121710196,"rs231242192","A/G","","3:121709000-121835200",G,G,G,G,G,G,G,G,G,G,G,G,G,G,G,G,G,G,G,G,G,G,G,G,G,G,G,G,G,G,G,G,G,A,G,G,G,
3,121710201,"rs46045021","A/G","","3:121709000-121835200",G,G,G,G,G,G,G,G,G,G,G,G,G,G,G,G,G,G,A,A,G,G,G,G,G,A,G,G,G,G,A,G,G,G,G,G,G,
3,121710236,"rs219937325","A/G","","3:121709000-121835200",A,A,A,A,A,A,A,A,A,A,A,A,A,A,A,A,A,A,A,A,A,A,A,A,A,A,A,A,A,A,G,A,A,A,A,A,A,
3,121710253,"rs250846239","A/G","","3:121709000-121835200",G,G,G,G,G,G,G,G,G,G,G,G,G,G,G,G,G,G,G,G,G,G,G,G,G,G,G,G,G,G,G,G,G,A,G,G,G,
3,121710295,"rs263909539","A/G","","3:121709000-121835200",G,G,G,G,G,G,G,G,G,G,G,G,G,G,G,G,G,G,G,G,G,G,G,G,G,G,G,G,G,G,G,G,G,A,G,G,G,
3,121710306,"rs221619258","A/G","","3:121709000-121835200",G,G,G,G,G,G,G,G,G,G,G,G,G,G,G,G,G,G,G,G,G,G,G,G,G,G,G,G,G,G,G,G,G,A,G,G,G,
3,121710347,"rs221156488","indel","","3:121709000-121835200",0,,,,,,,,,,,,,,,,,,,,,,,,,,,,,,,,,1,,,,
3,121710419,"rs239538030","A/G","","3:121709000-121835200",G,G,G,G,G,G,G,G,G,G,G,G,G,G,G,G,G,G,G,G,G,G,G,G,G,G,G,G,G,G,G,G,G,A,G,G,G,
3,121710437,"rs256722768","C/T","","3:121709000-121835200",T,T,T,T,T,T,T,T,T,T,T,T,T,T,T,T,T,T,T,T,T,T,T,T,T,T,T,T,T,T,T,T,T,C,T,T,T,
3,121710462,"rs225728963","A/T","","3:121709000-121835200",A,A,A,A,A,A,A,A,A,A,A,A,A,A,A,A,A,A,A,A,A,A,A,A,A,A,A,A,A,A,A,A,A,T,A,A,A,
3,121710465,"rs250286709","C/T","","3:121709000-121835200",C,C,C,C,C,C,C,C,C,C,C,C,C,C,C,C,C,C,C,C,C,C,C,C,C,C,C,C,C,C,C,C,C,T,C,C,C,
3,121710510,"rs264661488","A/G","","3:121709000-121835200",A,G,G,G,A,A,A,A,A,A,A,A,A,A,A,A,A,A,A,A,A,A,A,G,G,A,A,A,A,A,A,A,A,A,A,A,G,
3,121710564,,"indel","","3:121709000-121835200",0,,,,,,,,,,,,,,,,,,,,,,,,,,,,,,,,,1,,,,
3,121710569,"rs6375127","A/G","","3:121709000-121835200",G,G,G,G,G,G,G,G,G,G,G,G,G,G,G,G,G,G,A,A,G,G,G,G,G,A,G,G,G,G,A,G,G,G,G,G,G,
3,121710647,"rs31527176","A/G","","3:121709000-121835200",A,A,A,A,A,A,A,A,A,A,A,A,A,A,A,A,A,A,G,G,A,A,A,A,A,G,A,A,A,A,A,A,A,A,A,A,A,
3,121710721,"rs6375738","C/G","","3:121709000-121835200",G,G,G,G,G,G,G,G,G,G,G,G,G,G,G,G,G,G,C,C,G,G,G,G,G,C,G,G,G,G,G,G,G,G,G,G,G,
3,121710754,"rs227985065","C/T","","3:121709000-121835200",C,C,C,C,C,C,C,C,C,C,C,C,C,C,C,C,C,C,C,C,C,C,C,C,C,C,C,C,C,C,C,C,C,T,C,C,C,
3,121710780,"rs6376227","C/T","","3:121709000-121835200",C,T,T,T,C,C,C,C,C,C,C,C,C,C,C,C,T,C,T,T,C,C,C,T,T,T,C,C,C,C,T,C,T,T,C,T,T,
3,121710881,"rs221697311","C/T","","3:121709000-121835200",T,T,T,T,T,T,T,T,T,T,T,T,T,T,T,T,T,T,C,C,T,T,T,T,T,C,T,T,T,T,C,T,T,C,T,T,T,
3,121710904,"rs231655732","C/G","","3:121709000-121835200",C,C,C,C,C,C,C,C,C,C,C,C,C,C,C,C,C,C,C,C,C,C,C,C,C,C,C,C,C,C,C,C,C,G,C,C,C,
3,121710917,"rs256261753","A/G","","3:121709000-121835200",G,G,G,G,G,G,G,G,G,G,G,G,G,G,G,G,G,G,G,G,G,G,G,G,G,G,G,G,G,G,G,G,G,A,G,G,G,
3,121710938,"rs211697363","C/T","","3:121709000-121835200",C,C,C,C,C,C,C,C,C,C,C,C,C,C,C,C,C,C,C,C,C,C,C,C,C,C,C,C,C,C,C,C,C,T,C,C,C,
3,121710981,"rs30261386","A/C","","3:121709000-121835200",A,A,A,A,A,A,A,A,A,A,A,A,A,A,A,A,A,A,C,C,A,A,A,A,A,C,A,A,A,A,C,A,A,A,A,A,A,
3,121710994,"rs262972963","indel","","3:121709000-121835200",0,,,,,,,,,,,,,,,,,,,,,,,,,,,,,,,,,1,,,,
3,121711013,"rs263654953","A/C","","3:121709000-121835200",A,A,A,A,A,A,A,A,A,A,A,A,A,A,A,A,A,A,A,A,A,A,A,A,A,A,A,A,A,A,A,A,A,C,A,A,A,
3,121711041,"rs221301334","A/G","","3:121709000-121835200",G,G,G,G,G,G,G,G,G,G,G,G,G,G,G,G,G,G,G,G,G,G,G,G,G,G,G,G,G,G,G,G,G,A,G,G,G,
3,121711051,"rs239478305","A/G","","3:121709000-121835200",A,A,A,A,A,A,A,A,A,A,A,A,A,A,A,A,A,A,A,A,A,A,A,A,A,A,A,A,A,A,A,A,A,G,A,A,A,
3,121711053,"rs250713967","A/G","","3:121709000-121835200",G,G,G,G,G,G,G,G,G,G,G,G,G,G,G,G,G,G,G,G,G,G,G,G,G,G,G,G,G,G,G,G,G,A,G,G,G,
3,121711068,"rs219614155","A/G","","3:121709000-121835200",G,G,G,G,G,G,G,G,G,G,G,G,G,G,G,G,G,G,G,G,G,G,G,G,G,G,G,G,G,G,G,G,A,G,G,A,G,
3,121711086,"rs30261389","A/G","","3:121709000-121835200",G,A,A,A,G,G,G,G,G,G,G,G,G,G,G,G,G,G,G,G,G,G,G,G,A,G,G,G,G,G,G,G,G,G,G,G,A,
3,121711143,"rs30261392","A/G","","3:121709000-121835200",A,A,A,A,A,A,A,A,A,A,A,A,A,A,A,A,G,A,G,G,A,A,A,A,A,G,A,A,A,A,G,A,A,G,A,A,A,
3,121711144,"rs235048239","A/G","","3:121709000-121835200",G,G,G,G,G,G,G,G,G,G,G,G,G,G,G,G,G,G,G,G,G,G,G,G,G,G,G,G,G,G,G,G,G,A,G,G,G,
3,121711195,"rs30262305","C/T","","3:121709000-121835200",T,T,T,T,T,T,T,T,T,T,T,T,T,T,T,T,C,T,T,T,T,T,T,T,T,T,T,T,T,T,T,T,T,T,T,T,T,
3,121711223,"rs260076863","A/G","","3:121709000-121835200",G,G,G,G,G,G,G,G,G,G,G,G,G,G,G,G,G,G,G,G,G,G,G,G,G,G,G,G,G,G,G,G,G,G,G,A,G,
3,121711247,"rs30262308","A/C","","3:121709000-121835200",A,A,A,A,A,A,A,A,A,A,A,A,A,A,A,A,C,A,C,C,A,A,A,A,A,C,A,A,A,A,C,A,A,C,A,A,A,
3,121711286,"rs245897204","C/T","","3:121709000-121835200",C,C,C,C,C,C,C,C,C,C,C,C,C,C,C,C,C,C,C,C,C,C,C,C,C,C,C,C,C,C,C,C,C,T,C,C,C,
3,121711301,"rs214236638","A/G","","3:121709000-121835200",A,A,A,A,A,A,A,A,A,A,A,A,A,A,A,A,A,A,A,A,A,A,A,A,A,A,A,A,A,A,A,A,A,G,A,A,A,
3,121711315,"rs30253814","C/T","","3:121709000-121835200",C,C,C,C,C,C,C,C,C,C,C,C,C,C,C,C,T,C,C,C,C,C,C,C,C,C,C,C,C,C,C,C,C,C,C,C,C,
3,121711339,"rs30253817","C/T","","3:121709000-121835200",T,T,T,T,T,T,T,T,T,T,T,T,T,T,T,T,C,T,C,C,T,T,T,T,T,C,T,T,T,T,C,T,T,C,T,T,T,
3,121711358,"rs212058776","C/T","","3:121709000-121835200",C,C,C,C,C,C,C,C,C,C,C,C,C,C,C,C,C,C,C,C,C,C,C,C,C,C,C,C,C,C,C,C,C,T,C,C,C,
3,121711381,"rs242645113","C/T","","3:121709000-121835200",T,T,T,T,T,T,T,T,T,T,T,T,T,T,T,T,T,T,T,T,T,T,T,T,T,T,T,T,T,T,T,T,T,C,T,T,T,
3,121711392,"rs252397397","C/G","","3:121709000-121835200",G,G,G,G,G,G,G,G,G,G,G,G,G,G,G,G,G,G,G,G,G,G,G,G,G,G,G,G,G,G,G,G,G,C,G,G,G,
3,121711418,"rs215640182","A/G","","3:121709000-121835200",G,G,G,G,G,G,G,G,G,G,G,G,G,G,G,G,G,G,G,G,G,G,G,G,G,G,G,G,G,G,G,G,G,A,G,G,G,
3,121711513,"rs30210638","A/G","","3:121709000-121835200",A,A,A,A,A,A,A,A,A,A,A,A,A,A,A,A,G,A,G,G,A,A,A,A,A,G,A,A,A,A,G,A,A,G,A,A,A,
3,121711545,"rs250270544","A/G","","3:121709000-121835200",A,A,A,A,A,A,A,A,A,A,A,A,A,A,A,A,A,A,A,A,A,A,A,A,A,A,A,A,A,A,A,A,A,G,A,A,A,
3,121711559,"rs30253822","A/G","","3:121709000-121835200",A,A,A,A,A,A,A,A,A,A,A,A,A,A,A,A,A,A,G,G,A,A,A,A,A,G,A,A,A,A,G,A,A,A,A,A,A,
3,121711565,"rs242550446","A/G","","3:121709000-121835200",A,A,A,A,A,A,A,A,A,A,A,A,A,A,A,A,A,A,A,A,A,A,A,A,A,A,A,A,A,A,A,A,A,G,A,A,A,
3,121711609,"rs261181855","A/G","","3:121709000-121835200",G,G,G,G,G,G,G,G,G,G,G,G,G,G,G,G,G,G,G,G,G,G,G,G,G,G,G,G,G,G,G,G,G,A,G,G,G,
3,121711612,"rs227191817","A/G","","3:121709000-121835200",A,A,A,A,A,A,A,A,A,A,A,A,A,A,A,A,A,A,A,A,A,A,A,A,A,A,A,A,A,A,A,A,A,G,A,A,A,
3,121711712,"rs250676938","C/T","","3:121709000-121835200",C,C,C,C,C,C,C,C,C,C,C,C,C,C,C,C,C,C,C,C,C,C,C,C,C,C,C,C,C,C,C,C,C,T,C,C,C,
3,121711746,"rs247246811","indel","","3:121709000-121835200",0,,,,,,,,,,,,,,,,,,,,,,,,,,,,,,,,,1,,,,
3,121711762,"rs259963413","C/T","","3:121709000-121835200",T,T,T,T,T,T,T,T,T,T,T,T,T,T,T,T,T,T,T,T,T,T,T,T,T,T,T,T,T,T,T,T,T,C,T,T,T,
3,121711824,"rs227424164","A/T","","3:121709000-121835200",A,A,A,A,A,A,A,A,A,A,A,A,A,A,A,A,A,A,A,A,A,A,A,A,A,A,A,A,A,A,A,A,A,T,A,A,A,
3,121711851,"rs239845163","A/T","","3:121709000-121835200",T,T,T,T,T,T,T,T,T,T,T,T,T,T,T,T,T,T,T,T,T,T,T,T,T,T,T,T,T,T,T,T,T,A,T,T,T,
3,121711912,"rs257758041","C/T","","3:121709000-121835200",C,C,C,C,C,C,C,C,C,C,C,C,C,C,C,C,C,C,C,C,C,C,C,C,C,C,C,C,C,C,C,C,C,T,C,C,C,
3,121711930,"rs230046327","C/T","","3:121709000-121835200",T,T,T,,T,T,T,T,T,T,T,T,T,T,T,T,T,T,T,T,T,T,T,T,T,T,T,T,T,T,C,T,T,T,T,T,T,
3,121711938,"rs30254845","A/G","","3:121709000-121835200",G,G,G,G,G,G,G,G,G,G,G,G,G,G,G,G,G,G,A,A,G,G,G,G,G,A,G,G,G,G,A,G,G,G,G,G,G,
3,121711974,"rs257678938","indel","","3:121709000-121835200",0,1,1,1,,,,,,,,,,,,,2,,1,1,,,,,1,1,,,,,1,,1,3,,1,,
3,121712082,"rs264638833","G/T","","3:121709000-121835200",G,G,G,G,G,G,G,G,G,G,G,G,G,G,G,G,G,G,G,G,G,G,G,G,G,G,G,G,G,G,G,G,G,T,G,G,G,
3,121712135,"rs233812174","A/T","","3:121709000-121835200",T,T,T,T,T,T,T,T,T,T,T,T,T,T,T,T,T,T,T,T,T,T,T,T,T,T,T,T,T,T,T,T,A,T,T,A,T,
3,121712191,"rs246690146","C/T","","3:121709000-121835200",C,C,C,C,C,C,C,C,C,C,C,C,C,C,C,C,C,C,C,C,C,C,C,C,C,C,C,C,C,C,C,C,C,T,C,C,C,
3,121712193,"rs215591583","G/T","","3:121709000-121835200",G,G,G,G,G,G,G,G,G,G,G,G,G,G,G,G,G,G,G,G,G,G,G,G,G,G,G,G,G,G,G,G,G,T,G,G,G,
3,121712205,"rs585246872","A/C","","3:121709000-121835200",C,C,C,C,C,C,C,C,C,C,C,C,C,C,C,C,C,C,C,C,C,C,C,C,C,C,C,C,C,C,C,C,C,A,C,C,C,
3,121712217,"rs581921404","A/G","","3:121709000-121835200",G,G,G,G,G,G,G,G,G,G,G,G,G,G,G,G,G,G,G,G,G,G,G,G,G,G,G,G,G,G,G,G,G,A,G,G,G,
3,121712225,"rs232608512","A/G","","3:121709000-121835200",G,G,G,G,G,G,G,G,G,G,G,G,G,G,G,G,G,G,G,G,G,G,G,G,G,G,G,G,G,G,G,G,G,A,G,G,G,
3,121712235,"rs244360216","A/G","","3:121709000-121835200",A,A,A,A,A,A,A,A,A,A,A,A,A,A,A,A,A,A,A,A,A,A,A,A,A,A,A,A,A,A,A,A,A,G,A,A,A,
3,121712253,"rs213526346","C/T","","3:121709000-121835200",T,T,T,T,T,T,T,T,T,T,T,T,T,T,T,T,T,T,T,T,T,T,T,T,T,T,T,T,T,T,T,T,T,C,T,T,T,
3,121712301,"rs30254848","C/T","","3:121709000-121835200",C,C,C,C,C,C,C,C,C,C,C,C,C,C,C,C,C,C,T,T,C,C,C,C,C,T,C,C,C,C,T,C,C,C,C,C,C,
3,121712307,"rs257510524","indel","","3:121709000-121835200",0,,,,,,,,,,,,,,,,,,,,,,,,,,,,,,,,,1,,,,
3,121712321,"rs584501964","C/G","","3:121709000-121835200",G,G,G,G,G,G,G,G,G,G,G,G,G,G,G,G,G,G,G,G,G,G,G,G,G,G,G,G,G,G,G,G,G,C,G,G,G,
3,121712375,"rs255731932","A/G","","3:121709000-121835200",A,A,A,A,A,A,A,A,A,A,A,A,A,A,A,A,A,A,A,A,A,A,A,A,A,A,A,A,A,A,A,A,A,G,A,A,A,
3,121712478,"rs227517802","A/C","","3:121709000-121835200",A,A,A,A,A,A,A,A,A,A,A,A,A,A,A,A,A,A,A,A,A,A,A,A,A,A,A,A,A,A,A,A,A,C,A,A,A,
3,121712495,"rs30254851","C/T","","3:121709000-121835200",T,T,T,T,T,T,T,T,T,T,T,T,T,T,T,T,C,T,C,C,T,T,T,T,T,C,T,T,T,T,C,T,T,C,T,T,T,
3,121712532,"rs253952951","A/G","","3:121709000-121835200",A,A,A,A,A,A,A,A,A,A,A,A,A,A,A,A,A,A,A,A,A,A,A,A,A,A,A,A,A,A,A,A,A,G,A,A,A,
3,121712581,"rs221083052","C/T","","3:121709000-121835200",C,C,C,C,C,C,C,C,C,C,C,C,C,C,C,C,C,C,C,C,C,C,C,C,C,C,C,C,C,C,C,C,C,T,C,C,C,
3,121712619,"rs30255704","C/T","","3:121709000-121835200",T,T,T,T,T,T,T,T,T,T,T,T,T,T,T,T,C,T,C,C,T,T,T,T,T,C,T,T,T,T,C,T,T,C,T,T,T,
3,121712663,"rs248677859","indel","","3:121709000-121835200",0,,,,,,,,,,,,,,,,1,,0,,,,,,,1,,,,,1,,,1,,,,
3,121712669,,"indel","","3:121709000-121835200",0,,,,,,,,,,,,,,,,1,,,,,,,,,,,,,,1,,,1,,,,
3,121712670,"rs237828188","indel","","3:121709000-121835200",0,,,,,,,,,,,,,,,,,,1,1,,,,,,1,,,,,,,,,,,,
3,121712688,"rs221863127","A/G","","3:121709000-121835200",A,A,A,A,A,A,A,A,A,A,A,A,A,A,A,A,A,A,A,A,A,A,A,A,A,A,A,A,A,A,A,A,A,G,A,A,A,
3,121712771,"rs249814742","indel","","3:121709000-121835200",0,,,,,,,,,,,,,,,,,,,,,,,,,,,,,,,,1,1,,1,,
3,121712813,"rs244261485","G/T","","3:121709000-121835200",T,T,T,T,T,T,T,T,T,T,T,T,T,T,T,T,T,T,T,T,T,T,T,T,T,T,T,T,T,T,T,T,T,G,T,T,T,
3,121712820,"rs215521670","A/T","","3:121709000-121835200",A,A,A,A,A,A,A,A,A,A,A,A,A,A,A,A,T,A,T,T,A,A,A,A,A,T,A,A,A,A,T,A,A,T,A,A,A,
3,121712854,"rs234846076","C/T","","3:121709000-121835200",T,T,T,T,T,T,T,T,T,T,T,T,T,T,T,T,T,T,T,T,T,T,T,T,T,T,T,T,T,T,T,T,T,C,T,T,T,
3,121712866,"rs30255707","A/G","","3:121709000-121835200",G,G,G,G,G,G,G,G,G,G,G,G,G,G,G,G,A,G,G,G,G,G,G,G,G,G,G,G,G,G,G,G,G,G,G,G,G,
3,121712889,"rs50076294","C/T","","3:121709000-121835200",C,C,C,C,C,C,C,C,C,C,C,C,C,C,C,C,T,C,T,T,C,C,C,C,C,T,C,C,C,C,T,C,C,T,C,C,C,
3,121712896,"rs47447101","A/G","","3:121709000-121835200",A,A,A,A,A,A,A,A,A,A,A,A,A,A,A,A,G,A,G,G,A,A,A,A,A,G,A,A,A,A,G,A,A,A,A,A,A,
3,121712899,"rs226519622","A/C","","3:121709000-121835200",A,A,A,A,A,A,A,A,A,A,A,A,A,A,A,A,A,A,A,A,A,A,A,A,A,A,A,A,A,A,A,A,A,C,A,A,A,
3,121712904,"rs263803616","indel","","3:121709000-121835200",0,,,,,,,,,,,,,,,,1,,1,1,,,,,,1,,,,,1,,,,,,,
3,121712920,"rs50228894","A/C","","3:121709000-121835200",A,A,A,A,A,A,A,A,A,A,A,A,A,A,A,A,C,A,C,C,A,A,A,A,A,C,A,A,A,A,C,A,A,A,A,A,A,
3,121712925,"rs47111519","A/T","","3:121709000-121835200",A,A,A,A,A,A,A,A,A,A,A,A,A,A,A,A,T,A,T,T,A,A,A,A,A,T,A,A,A,A,T,A,A,A,A,A,A,
3,121712946,"rs45834345","G/T","","3:121709000-121835200",T,T,T,T,T,T,T,T,T,T,T,T,T,T,T,T,T,T,G,G,T,T,T,T,T,G,T,T,T,T,G,T,T,T,T,T,T,
3,121712951,"rs252208900","A/G","","3:121709000-121835200",G,G,G,G,G,G,G,G,G,G,G,G,G,G,G,G,G,G,G,G,G,G,G,G,G,G,G,G,G,G,G,G,G,A,G,G,G,
3,121712965,"rs49317841","A/G","","3:121709000-121835200",G,G,G,G,G,G,G,G,G,G,G,G,G,G,G,G,G,G,A,A,G,G,G,G,G,A,G,G,G,G,A,G,G,G,G,G,G,
3,121712979,"rs262527548","indel","","3:121709000-121835200",0,,,,,,,,,,,,,,,,,,,,,,,,,,,,,,,,1,2,,1,,
3,121712992,"rs52456919","A/T","","3:121709000-121835200",T,T,T,T,T,T,T,T,T,T,T,T,T,T,T,T,T,T,A,A,T,T,T,T,T,,T,T,T,T,A,T,T,T,T,T,T,
3,121712995,"rs261857899","A/T","","3:121709000-121835200",T,T,T,T,T,T,T,T,T,T,T,T,T,T,T,T,T,T,A,T,T,T,T,T,T,,T,T,T,T,,T,T,T,T,T,T,
3,121712997,"rs224643599","indel","","3:121709000-121835200",0,,,,,,,,,,,,,,,,1,,1,1,,,,,,1,,,,,1,,,,,,,
3,121712998,"rs223123613","A/T","","3:121709000-121835200",T,T,T,T,T,T,T,T,T,T,T,T,T,T,T,T,T,T,A,,T,T,T,T,T,,T,T,T,T,A,T,T,T,T,T,T,
3,121713018,"rs578780168","C/T","","3:121709000-121835200",T,T,T,T,T,T,T,T,T,T,T,T,T,T,T,T,T,T,T,T,T,T,T,T,T,T,T,T,T,T,T,T,T,C,T,T,T,
3,121713035,"rs30255710","C/T","","3:121709000-121835200",C,C,C,C,C,C,C,C,C,C,C,C,C,C,C,C,T,C,T,T,C,C,C,C,C,T,C,C,C,C,T,C,C,C,C,C,C,
3,121713040,"rs51680287","C/T","","3:121709000-121835200",T,T,T,T,T,T,T,T,T,T,T,T,T,T,T,T,T,T,C,C,T,T,T,T,T,C,T,T,T,T,C,T,T,T,T,T,T,
3,121713051,"rs30255713","C/G","","3:121709000-121835200",G,G,G,G,G,G,G,G,G,G,G,G,G,G,G,G,C,G,C,C,G,G,G,G,G,C,G,G,G,G,C,G,G,C,G,G,G,
3,121713077,"rs232907963","C/G","","3:121709000-121835200",C,C,C,C,C,C,C,C,C,C,C,C,C,C,C,C,C,C,C,C,C,C,C,C,C,C,C,C,C,C,C,C,C,G,C,C,C,
3,121713089,"rs257124951","A/C","","3:121709000-121835200",A,A,A,A,A,A,A,A,A,A,A,A,A,A,A,A,A,A,A,A,A,A,A,A,A,A,A,A,A,A,A,A,A,C,A,A,A,
3,121713094,"rs257252798","indel","","3:121709000-121835200",0,,,,,,,,,,,,,,,,1,,1,1,,,,,,1,,,,,1,,,,,,,
3,121713096,,,"","3:121709000-121835200",T,T,T,T,T,T,T,T,T,T,T,T,T,T,T,T,,T,,,T,T,T,T,T,,T,T,T,T,,T,T,T,T,T,T,
3,121713122,"rs264944065","indel","","3:121709000-121835200",0,,,,,,,,,,,,,,,,,,,,,,,,,,,,,,,,,1,,,,
3,121713126,"rs221205263","C/T","","3:121709000-121835200",C,C,C,C,C,C,C,C,C,C,C,C,C,C,C,C,C,C,C,C,C,C,C,C,C,C,C,C,C,C,C,C,T,C,C,T,C,
3,121713204,"rs241364155","A/G","","3:121709000-121835200",A,A,A,A,A,A,A,A,A,A,A,A,A,A,A,A,A,A,A,A,A,A,A,A,A,A,A,A,A,A,A,A,A,G,A,A,A,
3,121713234,"rs266201266","C/T","","3:121709000-121835200",T,T,T,T,T,T,T,T,T,T,T,T,T,T,T,T,T,T,T,T,T,T,T,T,T,T,T,T,T,T,T,T,T,C,T,T,T,
3,121713242,"rs30256659","A/C","","3:121709000-121835200",A,A,A,A,A,A,A,A,A,A,A,A,A,A,A,A,A,A,C,C,A,A,A,A,A,C,A,A,A,A,C,A,A,A,A,A,A,
3,121713284,"rs247197522","indel","","3:121709000-121835200",0,,,,,,,,,,,,,,,,,,,,,,,,,,,,,,,,,1,,,,
3,121713285,"rs30256662","A/C","","3:121709000-121835200",C,C,C,C,C,C,C,C,C,C,C,C,C,C,C,C,A,C,C,C,C,C,C,C,C,C,C,C,C,C,C,C,C,C,C,C,C,
3,121713293,"rs582487075","G/T","","3:121709000-121835200",T,T,T,T,T,T,T,T,T,T,T,T,T,T,T,T,T,T,T,T,T,T,T,T,T,T,T,T,T,T,T,T,T,G,T,T,T,
3,121713315,"rs234829150","indel","","3:121709000-121835200",0,,,,,,,,,,,,,,,,,,,,,,,,,,,,,,,,,1,,,,
3,121713331,"rs258046083","C/T","","3:121709000-121835200",C,C,C,C,C,C,C,C,C,C,C,C,C,C,C,C,T,C,C,C,C,C,C,C,C,C,C,C,C,C,C,C,C,C,C,C,C,
3,121713333,"rs30703238","C/T","","3:121709000-121835200",T,T,T,T,T,T,T,T,T,T,T,T,T,T,T,T,C,T,C,C,T,T,T,T,T,C,T,T,T,T,C,T,T,C,T,T,T,
3,121713337,"rs31343107","C/T","","3:121709000-121835200",T,T,T,T,T,T,T,T,T,T,T,T,T,T,T,T,C,T,C,C,T,T,T,T,T,C,T,T,T,T,C,T,T,C,T,T,T,
3,121713341,"rs30257535","G/T","","3:121709000-121835200",G,G,G,G,G,G,G,G,G,G,G,G,G,G,G,G,G,G,G,G,G,G,G,G,G,G,G,G,G,G,G,G,T,G,G,T,G,
3,121713384,"rs264919081","indel","","3:121709000-121835200",0,,,,,,,,,,,,,,,,1,,,,,,,,,,,,,,,,,,,,,
3,121713386,,,"","3:121709000-121835200",C,C,C,C,C,C,C,C,C,C,C,C,C,C,C,C,,C,C,C,C,C,C,C,C,C,C,C,C,C,C,C,C,C,C,C,C,
3,121713393,"rs30257538","C/T","","3:121709000-121835200",C,C,C,C,C,C,C,C,C,C,C,C,C,C,C,C,C,C,C,C,C,C,C,C,C,C,C,C,C,C,C,C,T,C,C,T,C,
3,121713413,"rs30257541","A/G","","3:121709000-121835200",A,A,A,A,A,A,A,A,A,A,A,A,A,A,A,A,G,A,A,A,A,A,A,A,A,A,A,A,A,A,A,A,A,G,A,A,A,
3,121713447,,,"","3:121709000-121835200",G,G,G,G,G,G,G,G,G,G,G,G,G,G,G,G,G,G,G,G,G,,G,G,G,G,G,G,G,G,G,G,G,G,G,G,G,
3,121713453,"rs218863347","A/G","","3:121709000-121835200",G,G,G,G,G,G,G,G,G,G,G,G,G,G,G,G,G,G,G,G,G,G,G,G,G,G,G,G,G,G,G,G,G,A,G,G,G,
3,121713500,"rs228744469","A/G","","3:121709000-121835200",A,A,A,A,A,A,A,A,A,A,A,A,A,A,A,A,A,A,A,A,A,A,A,A,A,A,A,A,A,A,A,A,A,G,A,A,A,
3,121713502,"rs247539359","A/G","","3:121709000-121835200",G,G,G,G,G,G,G,G,G,G,G,G,G,G,G,G,A,G,G,G,G,G,G,G,G,G,G,G,G,G,G,G,G,G,G,G,G,
3,121713503,"rs49900354","A/G","","3:121709000-121835200",G,G,G,G,G,G,G,G,G,G,G,G,G,G,G,G,G,G,A,A,G,G,G,G,G,A,G,G,G,G,A,G,G,G,G,G,G,
3,121713516,"rs233283871","C/G","","3:121709000-121835200",G,G,G,G,G,G,G,G,G,G,G,G,G,G,G,G,C,G,G,G,G,G,G,G,G,G,G,G,G,G,G,G,G,G,G,G,G,
3,121713554,"rs30352518","A/C","","3:121709000-121835200",C,C,C,C,C,C,C,C,C,C,C,C,C,C,C,C,C,C,A,A,C,C,C,C,C,A,C,C,C,C,A,C,C,C,C,C,C,
3,121713574,"rs212904254","A/G","","3:121709000-121835200",G,G,G,G,G,G,G,G,G,G,G,G,G,G,G,G,A,G,G,G,G,G,G,G,G,G,G,G,G,G,G,G,G,G,G,G,G,
3,121713618,"rs236408532","C/T","","3:121709000-121835200",C,C,C,C,C,C,C,C,C,C,C,C,C,C,C,C,C,C,C,C,C,C,C,C,C,C,C,C,C,C,C,C,C,T,C,C,C,
3,121713655,"rs30257543","A/G","","3:121709000-121835200",A,A,A,A,A,A,A,A,A,A,A,A,A,A,A,A,G,A,A,A,A,A,A,A,A,A,A,A,A,A,A,A,A,A,A,A,A,
3,121713681,"rs222126313","C/G","","3:121709000-121835200",G,G,G,G,G,G,G,G,G,G,G,G,G,G,G,G,G,G,G,G,G,G,G,G,G,G,G,G,G,G,G,G,G,C,G,G,G,
3,121713702,,,"","3:121709000-121835200",G,G,G,G,G,G,G,G,G,A,G,G,G,G,G,G,G,G,G,G,G,G,G,G,G,G,G,G,G,G,G,G,G,G,G,G,G,
3,121713714,"rs30258476","C/T","","3:121709000-121835200",T,T,T,T,T,T,T,T,T,T,T,T,T,T,T,T,C,T,T,T,T,T,T,T,T,T,T,T,T,T,T,T,T,T,T,T,T,
3,121713725,"rs30258479","A/G","","3:121709000-121835200",G,G,G,G,G,G,G,G,G,G,G,G,G,G,G,G,A,G,G,G,G,G,G,G,G,G,G,G,G,G,G,G,G,G,G,G,G,
3,121713751,"rs220652617","A/G","","3:121709000-121835200",G,G,G,G,G,G,G,G,G,G,G,G,G,G,G,G,G,G,G,G,G,G,G,G,G,G,G,G,G,G,G,G,A,G,G,A,G,
3,121713770,"rs30258482","C/G","","3:121709000-121835200",C,C,C,C,C,C,C,C,C,C,C,C,C,C,C,C,G,C,G,G,C,C,C,C,C,G,C,C,C,C,G,C,C,G,C,C,C,
3,121713773,"rs235524756","A/T","","3:121709000-121835200",T,T,T,T,T,T,T,T,T,T,T,T,T,T,T,T,A,T,A,A,T,T,T,T,T,A,T,T,T,T,A,T,T,A,T,T,T,
3,121713837,"rs228288366","C/T","","3:121709000-121835200",C,C,C,C,C,C,C,C,C,C,C,C,C,C,C,C,T,C,C,C,C,C,C,C,C,C,C,C,C,C,C,C,C,C,C,C,C,
3,121713865,"rs30259355","C/T","","3:121709000-121835200",T,T,T,T,T,T,T,T,T,T,T,T,T,T,T,T,C,T,C,C,T,T,T,T,T,C,T,T,T,T,C,T,T,C,T,T,T,