measnum,projsym,mpdsector,seriestype,keymeasnum,varname,descrip,descrip2,units,datatype,magnitude,method,intervention,paneldesc,sextested,ageweeks,granularity,sourceparm,projyear,extname,reference,association,nstrainstested,listorder,label,supplemental,native_method,is_covar,is_measure,upload_factors,file_column,is_baseline,is_control,private,strain,sex,mean,sd,nmice,zscore
1501,Dietrich1,css,,1501,anthrax_lethal_toxin,"susceptibility to Bacillus anthracis (0=susceptible, 1=resistant)",,designation,,,in vitro assay,Bacillus anthracis lethal toxin,inbred,f,6-8wks*,strainsex,,1998,,,,50,1,,,,,True,,,False,False,,BXH10/TyJ,f,1.00,,,1.03
39201,Gupta2,css,,39201,bw,body weight,,g,,,body weight,,BXH,both,postnatal d1,animal,,2011,,,,10,1,,,,,True,,,False,False,,BXH10/TyJ,m,1.27,0.212,14,-1.88
39201,Gupta2,css,,39201,bw,body weight,,g,,,body weight,,BXH,both,postnatal d1,animal,,2011,,,,10,1,,,,,True,,,False,False,,BXH10/TyJ,f,1.32,0.108,13,-0.63
39202,Gupta2,css,leftright,39202,kidneyL,kidney weight,left,g,,,organ weights,,BXH,both,postnatal d1,animal,,2011,,,,10,2,left,,,,True,,,False,False,,BXH10/TyJ,m,0.00670,0.00150,14,-0.02
39202,Gupta2,css,leftright,39202,kidneyL,kidney weight,left,g,,,organ weights,,BXH,both,postnatal d1,animal,,2011,,,,10,2,left,,,,True,,,False,False,,BXH10/TyJ,f,0.00655,0.000701,13,0.11
39203,Gupta2,css,leftright,39202,kidneyR,kidney weight,right,g,,,organ weights,,BXH,both,postnatal d1,animal,,2011,,,,10,3,right,,,,True,,,False,False,,BXH10/TyJ,m,0.00686,0.00140,14,-0.17
39203,Gupta2,css,leftright,39202,kidneyR,kidney weight,right,g,,,organ weights,,BXH,both,postnatal d1,animal,,2011,,,,10,3,right,,,,True,,,False,False,,BXH10/TyJ,f,0.00681,0.000653,13,0.49
39204,Gupta2,css,leftright,39202,kidneys,kidney weight,both,g,,,organ weights,,BXH,both,postnatal d1,animal,,2011,,,,10,4,both,1,,,True,,,False,False,,BXH10/TyJ,m,0.0136,0.00280,14,0.03
39204,Gupta2,css,leftright,39202,kidneys,kidney weight,both,g,,,organ weights,,BXH,both,postnatal d1,animal,,2011,,,,10,4,both,1,,,True,,,False,False,,BXH10/TyJ,f,0.0134,0.00104,13,0.36
39205,Gupta2,css,leftright,39205,pct_kidneyL,percent kidney weight to body weight,left,%,,,organ weights,,BXH,both,postnatal d1,animal,,2011,,,,10,5,left,,,,True,,,False,False,,BXH10/TyJ,m,0.527,0.0676,14,1.12
39205,Gupta2,css,leftright,39205,pct_kidneyL,percent kidney weight to body weight,left,%,,,organ weights,,BXH,both,postnatal d1,animal,,2011,,,,10,5,left,,,,True,,,False,False,,BXH10/TyJ,f,0.500,0.0631,13,0.66
39206,Gupta2,css,leftright,39205,pct_kidneyR,percent kidney weight to body weight,right,%,,,organ weights,,BXH,both,postnatal d1,animal,,2011,,,,10,6,right,,,,True,,,False,False,,BXH10/TyJ,m,0.539,0.0419,14,1.21
39206,Gupta2,css,leftright,39205,pct_kidneyR,percent kidney weight to body weight,right,%,,,organ weights,,BXH,both,postnatal d1,animal,,2011,,,,10,6,right,,,,True,,,False,False,,BXH10/TyJ,f,0.518,0.0543,13,1.05
39208,Gupta2,css,leftright,39205,pct_kidneys,percent kidney weight to body weight,both,%,,,organ weights,,BXH,both,postnatal d1,animal,,2011,,,,10,8,both,1,,,True,,,False,False,,BXH10/TyJ,m,1.07,0.0943,14,1.22
39208,Gupta2,css,leftright,39205,pct_kidneys,percent kidney weight to body weight,both,%,,,organ weights,,BXH,both,postnatal d1,animal,,2011,,,,10,8,both,1,,,True,,,False,False,,BXH10/TyJ,f,1.02,0.0977,13,0.99
39209,Gupta2,css,leftright,39209,area_kidneyL,kidney planar surface area,left,mm<sup>2</sup>,,,organ dimensions,,BXH,both,postnatal d1,animal,,2011,,,,10,9,left,,,,True,,,False,False,,BXH10/TyJ,m,5.13,0.887,14,0.95
39209,Gupta2,css,leftright,39209,area_kidneyL,kidney planar surface area,left,mm<sup>2</sup>,,,organ dimensions,,BXH,both,postnatal d1,animal,,2011,,,,10,9,left,,,,True,,,False,False,,BXH10/TyJ,f,5.09,0.611,13,1.45
39211,Gupta2,css,leftright,39209,area_kidneyR,kidney planar surface area,right,mm<sup>2</sup>,,,organ dimensions,,BXH,both,postnatal d1,animal,,2011,,,,10,11,right,,,,True,,,False,False,,BXH10/TyJ,m,4.63,1.02,14,0.86
39211,Gupta2,css,leftright,39209,area_kidneyR,kidney planar surface area,right,mm<sup>2</sup>,,,organ dimensions,,BXH,both,postnatal d1,animal,,2011,,,,10,11,right,,,,True,,,False,False,,BXH10/TyJ,f,4.57,0.379,13,0.96
39212,Gupta2,css,leftright,39212,adj_area_kidneyL,normalized kidney planar surface area,left,mm<sup>2</sup>/g,,,organ dimensions,,BXH,both,postnatal d1,animal,,2011,,,,10,12,left,,,,True,,,False,False,,BXH10/TyJ,m,4.05,0.278,14,2.19
39212,Gupta2,css,leftright,39212,adj_area_kidneyL,normalized kidney planar surface area,left,mm<sup>2</sup>/g,,,organ dimensions,,BXH,both,postnatal d1,animal,,2011,,,,10,12,left,,,,True,,,False,False,,BXH10/TyJ,f,3.88,0.502,13,1.79
39213,Gupta2,css,leftright,39212,adj_area_kidneyR,normalized kidney planar surface area,right,mm<sup>2</sup>/g,,,organ dimensions,,BXH,both,postnatal d1,animal,,2011,,,,10,13,right,,,,True,,,False,False,,BXH10/TyJ,m,3.64,0.336,14,1.82
39213,Gupta2,css,leftright,39212,adj_area_kidneyR,normalized kidney planar surface area,right,mm<sup>2</sup>/g,,,organ dimensions,,BXH,both,postnatal d1,animal,,2011,,,,10,13,right,,,,True,,,False,False,,BXH10/TyJ,f,3.48,0.330,13,1.14
39214,Gupta2,css,,39214,pressure_urethra,urethral hydrostatic pressure at which dye is observed flowing,,cm,,,renal function assay,,BXH,both,postnatal d1,animal,,2011,,,,10,14,,,,,True,,,False,False,,BXH10/TyJ,m,53.6,12.8,14,-1.61
39214,Gupta2,css,,39214,pressure_urethra,urethral hydrostatic pressure at which dye is observed flowing,,cm,,,renal function assay,,BXH,both,postnatal d1,animal,,2011,,,,10,14,,,,,True,,,False,False,,BXH10/TyJ,f,57.7,8.32,13,-1.36
39215,Gupta2,css,,39215,refluxVUR_index,vesico-ureteric reflux (VUR) index,,score,,,renal function assay,,BXH,both,postnatal d1,animal,,2011,,,,10,15,,,,,True,,,False,False,,BXH10/TyJ,m,0,0,14,-1.03
39215,Gupta2,css,,39215,refluxVUR_index,vesico-ureteric reflux (VUR) index,,score,,,renal function assay,,BXH,both,postnatal d1,animal,,2011,,,,10,15,,,,,True,,,False,False,,BXH10/TyJ,f,0,0,13,-1.00
42402,Donahue15,css,,42402,litter_interval,mean litter interval,,wks,,,colony observation,,BXH,f,3-55wks,animal,,2011,,,,11,2,,,,,True,,,False,False,,BXH10/TyJ,f,5.16,2.11,8,-0.02
42403,Donahue15,css,,42403,litter_size_birth,mean number of pups born,,n,,,colony observation,,BXH,f,3-55wks,animal,,2011,,,,11,3,,,,,True,,,False,False,,BXH10/TyJ,f,4.95,0.953,8,0.18
42404,Donahue15,css,,42404,litter_size_wean,mean number of pups weaned,,n,,,colony observation,,BXH,f,3-55wks,animal,,2011,,,,11,4,,,,,True,,,False,False,,BXH10/TyJ,f,4.21,0.757,8,-0.17
42405,Donahue15,css,,42405,ratio_wean_born,ratio of pups weaned to pups born,,ratio,,,colony observation,,BXH,f,3-55wks,animal,,2011,,,,11,5,,,,,True,,,False,False,,BXH10/TyJ,f,0.787,0.146,8,-0.93
42406,Donahue15,css,,42406,fecundity_index,mean litter size divided by mean litter interval,,n/wks,,,colony observation,,BXH,f,3-55wks,animal,,2011,,,,11,6,,,,,True,,,False,False,,BXH10/TyJ,f,1.06,0.346,8,0.23
42407,Donahue15,css,,42407,pct_Fwean,percent females at weaning,,%,,,colony observation,,BXH,f,3-55wks,animal,,2011,,,,11,7,,,,,True,,,False,False,,BXH10/TyJ,f,42.0,16.0,8,-1.98
44601,HMDPpheno1,css,,44601,BMD_body,"whole body bone mineral density (BMD; skull, lumbar spine, left femur excluded)",,g/cm<sup>2</sup>,,,DXA,,HMDP w/par,m,16wks,animal,,2011,,,,96,1,,,,,True,,,False,False,,BXH10/TyJ,m,0.0450,0.00335,11,-0.90
44602,HMDPpheno1,css,,44602,BMD_femur,bone mineral density (BMD) of left femur,,g/cm<sup>2</sup>,,,DXA,,HMDP w/par,m,16wks,animal,,2011,,,,96,2,,,,,True,,,False,False,,BXH10/TyJ,m,0.0681,0.0101,11,-1.11
44603,HMDPpheno1,css,,44603,BMD_spine,bone mineral density (BMD) of lumbar spine,,g/cm<sup>2</sup>,,,DXA,,HMDP w/par,m,16wks,animal,,2011,,,,96,3,,,,,True,,,False,False,,BXH10/TyJ,m,0.0493,0.00425,11,-1.43
46401,HMDPpheno2,css,,46401,HDL,HDL cholesterol (plasma HDL),,mg/dL,,,lipid profile,,HMDP w/par,m,16wks,animal,,2010,,,,99,1,,,,,True,,,False,False,,BXH10/TyJ,m,86.0,10.0,6,-0.29
46402,HMDPpheno2,css,,46402,LDL_VLDL,low density lipoprotein (plasma LDL) plus very low density lipoprotein (plasma VLDL),,mg/dL,,,lipid profile,,HMDP w/par,m,16wks,animal,,2010,,,,99,2,,,,,True,,,False,False,,BXH10/TyJ,m,21.3,9.22,6,-0.10
46403,HMDPpheno2,css,,46403,CHOL_un,unesterified cholesterol (plasma CHOL),,mg/dL,,,lipid profile,,HMDP w/par,m,16wks,animal,,2010,,,,99,3,,,,,True,,,False,False,,BXH10/TyJ,m,18.5,3.94,6,-0.38
46404,HMDPpheno2,css,,46404,CHOL_tot,total cholesterol (plasma CHOL),,mg/dL,,,lipid profile,,HMDP w/par,m,16wks,animal,,2010,,,,99,4,,,,,True,,,False,False,,BXH10/TyJ,m,107,17.4,6,-0.24
46405,HMDPpheno2,css,,46405,FFA,free fatty acids (plasma FFA),,mEq/L,,,lipid profile,,HMDP w/par,m,16wks,animal,,2010,,,,99,5,,,,,True,,,False,False,,BXH10/TyJ,m,45.2,9.33,6,-0.34
46406,HMDPpheno2,css,,46406,TG,"triglycerides (plasma TG, 16h fast)",,mg/dL,,,lipid profile,,HMDP w/par,m,16wks,animal,,2010,,,,99,6,,,,,True,,,False,False,,BXH10/TyJ,m,34.5,21.8,6,-0.64
46407,HMDPpheno2,css,,46407,pct_fat,"percentage of tissue mass that is fat, whole body with head (NMR)",,%,,,NMR,,HMDP w/par,m,16wks,animal,,2010,,,,99,7,,,,,True,,,False,False,,BXH10/TyJ,m,15.9,3.29,6,0.21
46801,HMDPpheno4,css,series,46801,ftr_pre_thig,"fear training, percent time spent near chamber walls, day1",pre-stimulus,%,,,fear conditioning test,,HMDP w/par,m,10wks,animal,,2011,,,,94,1,pre-stimulus,,,,True,,,False,False,,BXH10/TyJ,m,40.9,26.4,10,-1.18
46802,HMDPpheno4,css,series,46801,ftr_post_thig,"fear training, percent time spent near chamber walls, day1",post-stimulus,%,,,fear conditioning test,,HMDP w/par,m,10wks,animal,,2011,,,,94,2,post-stimulus,,,,True,,,False,False,,BXH10/TyJ,m,43.9,24.0,10,-2.01
46811,HMDPpheno4,css,series,46811,ftr_pre_vel,"fear training, velocity, day 1",pre-stimulus,cm/s,,,fear conditioning test,,HMDP w/par,m,10wks,animal,,2011,,,,94,11,pre-stimulus,,,,True,,,False,False,,BXH10/TyJ,m,4.88,2.18,10,-0.59
46812,HMDPpheno4,css,series,46811,ftr_post_vel,"fear training, velocity, day 1",post-stimulus,cm/s,,,fear conditioning test,,HMDP w/par,m,10wks,animal,,2011,,,,94,12,post-stimulus,,,,True,,,False,False,,BXH10/TyJ,m,3.33,0.878,10,-0.34
46821,HMDPpheno4,css,series,46821,ftr_pre_imob,"fear training, percent time immobile, day 1",pre-stimulus,%,,,fear conditioning test,,HMDP w/par,m,10wks,animal,,2011,,,,94,21,pre-stimulus,,,,True,,,False,False,,BXH10/TyJ,m,9.07,9.52,10,-0.52
46822,HMDPpheno4,css,series,46821,ftr_post_imob,"fear training, percent time immobile, day 1",post-stimulus,%,,,fear conditioning test,,HMDP w/par,m,10wks,animal,,2011,,,,94,22,post-stimulus,,,,True,,,False,False,,BXH10/TyJ,m,17.1,13.9,10,-0.86
46831,HMDPpheno4,css,,46831,ftr_post_act_burst,"fear training activity burst to footshock, shock reactivity, day 1",,cm/s,,,fear conditioning test,,HMDP w/par,m,10wks,animal,,2011,,,,94,31,,,,,True,,,False,False,,BXH10/TyJ,m,25.4,15.6,10,-1.20
46836,HMDPpheno4,css,,46836,ctx_thig,"contextual fear thigmotaxis, percent time spent near chamber walls, day 2",,%,,,fear conditioning test,,HMDP w/par,m,10wks,animal,,2011,,,,94,36,,,,,True,,,False,False,,BXH10/TyJ,m,33.6,33.0,10,-1.80
46841,HMDPpheno4,css,,46841,ctx_vel,"contextual fear velocity, day 2",,cm/s,,,fear conditioning test,,HMDP w/par,m,10wks,animal,,2011,,,,94,41,,,,,True,,,False,False,,BXH10/TyJ,m,3.39,1.12,10,0.03
46846,HMDPpheno4,css,,46846,ctx_imob,"contextual fear percent time immobile, day 2",,%,,,fear conditioning test,,HMDP w/par,m,10wks,animal,,2011,,,,94,46,,,,,True,,,False,False,,BXH10/TyJ,m,29.8,24.1,10,-0.33
46851,HMDPpheno4,css,series,46851,precue_thig,"cued fear thigmotaxis, percent time spent near chamber walls, day 3",pre-cue,%,,,fear conditioning test,,HMDP w/par,m,10wks,animal,,2011,,,,94,51,pre-cue,,,,True,,,False,False,,BXH10/TyJ,m,64.7,16.5,10,-0.85
46852,HMDPpheno4,css,series,46851,cue_thig,"cued fear thigmotaxis, percent time spent near chamber walls, day 3",cue,%,,,fear conditioning test,,HMDP w/par,m,10wks,animal,,2011,,,,94,52,cue,,,,True,,,False,False,,BXH10/TyJ,m,55.0,15.7,10,-1.58
46861,HMDPpheno4,css,series,46861,precue_vel,"cued fear, velocity, day 3",pre-cue,cm/s,,,fear conditioning test,,HMDP w/par,m,10wks,animal,,2011,,,,94,61,pre-cue,,,,True,,,False,False,,BXH10/TyJ,m,3.97,1.33,10,-0.16
46862,HMDPpheno4,css,series,46861,cue_vel,"cued fear, velocity, day 3",cue,cm/s,,,fear conditioning test,,HMDP w/par,m,10wks,animal,,2011,,,,94,62,cue,,,,True,,,False,False,,BXH10/TyJ,m,0.718,0.196,10,-0.10
46871,HMDPpheno4,css,series,46871,precue_imob,"cued fear, percent time immobile, day 3",pre-cue,%,,,fear conditioning test,,HMDP w/par,m,10wks,animal,,2011,,,,94,71,pre-cue,,,,True,,,False,False,,BXH10/TyJ,m,22.3,14.6,10,0.15
46872,HMDPpheno4,css,series,46871,cue_imob,"cued fear, percent time immobile, day 3",cue,%,,,fear conditioning test,,HMDP w/par,m,10wks,animal,,2011,,,,94,72,cue,,,,True,,,False,False,,BXH10/TyJ,m,28.3,12.3,10,-0.16
50101,HMDPpheno6,css,,50101,Ala,"liver alanine (16h fast), relative abundance",,,,,metabolite quantification,,HMDP w/par,m,16wks,animal,,2014,,,,106,1,,,,,True,,,False,False,,BXH10/TyJ,m,60626972,0,1,-0.80
50102,HMDPpheno6,css,,50102,Asn,"liver asparagine (16h fast), relative abundance",,,,,metabolite quantification,,HMDP w/par,m,16wks,animal,,2014,,,,106,2,,,,,True,,,False,False,,BXH10/TyJ,m,118331,0,1,-1.45
50103,HMDPpheno6,css,,50103,Asp,"liver aspartate (16h fast), relative abundance",,,,,metabolite quantification,,HMDP w/par,m,16wks,animal,,2014,,,,106,3,,,,,True,,,False,False,,BXH10/TyJ,m,8530973,0,1,-1.09
50104,HMDPpheno6,css,,50104,beta_Ala,"liver beta-alanine (16h fast), relative abundance",,,,,metabolite quantification,,HMDP w/par,m,16wks,animal,,2014,,,,106,4,,,,,True,,,False,False,,BXH10/TyJ,m,1006604,0,1,1.19
50105,HMDPpheno6,css,,50105,acetyl_Asn,"liver N-acetylasparagine (16h fast), relative abundance",,,,,metabolite quantification,,HMDP w/par,m,16wks,animal,,2014,,,,103,5,,,,,True,,,False,False,,BXH10/TyJ,m,45184,0,1,-0.87
50106,HMDPpheno6,css,,50106,acetyl_Ala,"liver N-acetylalanine (16h fast), relative abundance",,,,,metabolite quantification,,HMDP w/par,m,16wks,animal,,2014,,,,104,6,,,,,True,,,False,False,,BXH10/TyJ,m,19614,0,1,-0.43
50107,HMDPpheno6,css,,50107,aminobutyrate,"liver 2-aminobutyrate (16h fast), relative abundance",,,,,metabolite quantification,,HMDP w/par,m,16wks,animal,,2014,,,,106,7,,,,,True,,,False,False,,BXH10/TyJ,m,1216670,0,1,-0.42
50108,HMDPpheno6,css,,50108,creatine,"liver creatine (16h fast), relative abundance",,,,,metabolite quantification,,HMDP w/par,m,16wks,animal,,2014,,,,106,8,,,,,True,,,False,False,,BXH10/TyJ,m,5090144,0,1,1.64
50109,HMDPpheno6,css,,50109,AHB,"liver 2-hydroxybutyrate (AHB) (16h fast), relative abundance",,,,,metabolite quantification,,HMDP w/par,m,16wks,animal,,2014,,,,99,9,,,,,True,,,False,False,,BXH10/TyJ,m,136229,0,1,-0.47
50110,HMDPpheno6,css,,50110,Cys,"liver cysteine (16h fast), relative abundance",,,,,metabolite quantification,,HMDP w/par,m,16wks,animal,,2014,,,,106,10,,,,,True,,,False,False,,BXH10/TyJ,m,755059,0,1,-1.54
50111,HMDPpheno6,css,,50111,hypotaurine,"liver hypotaurine (16h fast), relative abundance",,,,,metabolite quantification,,HMDP w/par,m,16wks,animal,,2014,,,,106,11,,,,,True,,,False,False,,BXH10/TyJ,m,1163373,0,1,-0.32
50112,HMDPpheno6,css,,50112,Met,"liver methionine (16h fast), relative abundance",,,,,metabolite quantification,,HMDP w/par,m,16wks,animal,,2014,,,,106,12,,,,,True,,,False,False,,BXH10/TyJ,m,8246970,0,1,0.87
50113,HMDPpheno6,css,,50113,Met_sulf,"liver methionine sulfoxide (16h fast), relative abundance",,,,,metabolite quantification,,HMDP w/par,m,16wks,animal,,2014,,,,104,13,,,,,True,,,False,False,,BXH10/TyJ,m,61726,0,1,-1.19
50114,HMDPpheno6,css,,50114,taurine,"liver taurine (16h fast), relative abundance",,,,,metabolite quantification,,HMDP w/par,m,16wks,animal,,2014,,,,106,14,,,,,True,,,False,False,,BXH10/TyJ,m,1724912,0,1,1.72
50115,HMDPpheno6,css,,50115,acetyl_Met,"liver N-acetylmethionine (16h fast), relative abundance",,,,,metabolite quantification,,HMDP w/par,m,16wks,animal,,2014,,,,106,15,,,,,True,,,False,False,,BXH10/TyJ,m,12043,0,1,-1.40
50116,HMDPpheno6,css,,50116,SAH,"liver S-adenosylhomocysteine (SAH) (16h fast), relative abundance",,,,,metabolite quantification,,HMDP w/par,m,16wks,animal,,2014,,,,106,16,,,,,True,,,False,False,,BXH10/TyJ,m,42905,0,1,0.37
50117,HMDPpheno6,css,,50117,GABA,"liver gamma-aminobutyrate (GABA) (16h fast), relative abundance",,,,,metabolite quantification,,HMDP w/par,m,16wks,animal,,2014,,,,106,17,,,,,True,,,False,False,,BXH10/TyJ,m,518563,0,1,0.71
50118,HMDPpheno6,css,,50118,acetyl_Glu,"liver N-acetylglutamate (16h fast), relative abundance",,,,,metabolite quantification,,HMDP w/par,m,16wks,animal,,2014,,,,106,18,,,,,True,,,False,False,,BXH10/TyJ,m,148921,0,1,-0.21
50119,HMDPpheno6,css,,50119,Gln,"liver glutamine (16h fast), relative abundance",,,,,metabolite quantification,,HMDP w/par,m,16wks,animal,,2014,,,,106,19,,,,,True,,,False,False,,BXH10/TyJ,m,11743907,0,1,0.06
50120,HMDPpheno6,css,,50120,Glu,"liver glutamate (16h fast), relative abundance",,,,,metabolite quantification,,HMDP w/par,m,16wks,animal,,2014,,,,106,20,,,,,True,,,False,False,,BXH10/TyJ,m,6376534,0,1,0.48
50121,HMDPpheno6,css,,50121,CySSG,"liver cysteine-glutathione disulfide (16h fast), relative abundance",,,,,metabolite quantification,,HMDP w/par,m,16wks,animal,,2014,,,,106,21,,,,,True,,,False,False,,BXH10/TyJ,m,1852151,0,1,-0.55
50122,HMDPpheno6,css,,50122,GSH,"liver glutathione, reduced (GSH) (16h fast), relative abundance",,,,,metabolite quantification,,HMDP w/par,m,16wks,animal,,2014,,,,104,22,,,,,True,,,False,False,,BXH10/TyJ,m,291110,0,1,0.22
50123,HMDPpheno6,css,,50123,GSSG,"liver glutathione, oxidized (GSSG) (16h fast), relative abundance",,,,,metabolite quantification,,HMDP w/par,m,16wks,animal,,2014,,,,106,23,,,,,True,,,False,False,,BXH10/TyJ,m,11327277,0,1,-0.37
50124,HMDPpheno6,css,,50124,Me_glutathione,"liver S-methylglutathione (16h fast), relative abundance",,,,,metabolite quantification,,HMDP w/par,m,16wks,animal,,2014,,,,106,24,,,,,True,,,False,False,,BXH10/TyJ,m,159782,0,1,-0.10
50125,HMDPpheno6,css,,50125,ophthalmate,"liver ophthalmate (16h fast), relative abundance",,,,,metabolite quantification,,HMDP w/par,m,16wks,animal,,2014,,,,106,25,,,,,True,,,False,False,,BXH10/TyJ,m,443839,0,1,-0.60
50126,HMDPpheno6,css,,50126,oxoproline,"liver 5-oxoproline (16h fast), relative abundance",,,,,metabolite quantification,,HMDP w/par,m,16wks,animal,,2014,,,,106,26,,,,,True,,,False,False,,BXH10/TyJ,m,166446,0,1,-0.52
50127,HMDPpheno6,css,,50127,acetyl_Gly,"liver N-acetylglycine (16h fast), relative abundance",,,,,metabolite quantification,,HMDP w/par,m,16wks,animal,,2014,,,,96,27,,,,,True,,,False,False,,BXH10/TyJ,m,20245,0,1,-1.85
50128,HMDPpheno6,css,,50128,diMe_Gly,"liver dimethylglycine (16h fast), relative abundance",,,,,metabolite quantification,,HMDP w/par,m,16wks,animal,,2014,,,,96,28,,,,,True,,,False,False,,BXH10/TyJ,m,112123,0,1,-1.07
50129,HMDPpheno6,css,,50129,Gly,"liver glycine (16h fast), relative abundance",,,,,metabolite quantification,,HMDP w/par,m,16wks,animal,,2014,,,,106,29,,,,,True,,,False,False,,BXH10/TyJ,m,22384110,0,1,-1.88
50130,HMDPpheno6,css,,50130,homo_Ser,"liver homoserine (16h fast), relative abundance",,,,,metabolite quantification,,HMDP w/par,m,16wks,animal,,2014,,,,104,30,,,,,True,,,False,False,,BXH10/TyJ,m,64673,0,1,-0.15
50131,HMDPpheno6,css,,50131,Ser,"liver serine (16h fast), relative abundance",,,,,metabolite quantification,,HMDP w/par,m,16wks,animal,,2014,,,,106,31,,,,,True,,,False,False,,BXH10/TyJ,m,21215362,0,1,-1.04
50132,HMDPpheno6,css,,50132,Thr,"liver threonine (16h fast), relative abundance",,,,,metabolite quantification,,HMDP w/par,m,16wks,animal,,2014,,,,106,32,,,,,True,,,False,False,,BXH10/TyJ,m,6850352,0,1,-0.79
50133,HMDPpheno6,css,,50133,betaine,"liver betaine (16h fast), relative abundance",,,,,metabolite quantification,,HMDP w/par,m,16wks,animal,,2014,,,,106,33,,,,,True,,,False,False,,BXH10/TyJ,m,4903283,0,1,-0.65
50134,HMDPpheno6,css,,50134,betaine_aldehyde,"liver betaine aldehyde (16h fast), relative abundance",,,,,metabolite quantification,,HMDP w/par,m,16wks,animal,,2014,,,,106,34,,,,,True,,,False,False,,BXH10/TyJ,m,2151875,0,1,1.70
50135,HMDPpheno6,css,,50135,MeC_Gly,"liver 3-methylcrotonylglycine (16h fast), relative abundance",,,,,metabolite quantification,,HMDP w/par,m,16wks,animal,,2014,,,,98,35,,,,,True,,,False,False,,BXH10/TyJ,m,45255,0,1,0.08
50136,HMDPpheno6,css,,50136,guanidino,"liver 4-guanidinobutanoate (16h fast), relative abundance",,,,,metabolite quantification,,HMDP w/par,m,16wks,animal,,2014,,,,94,36,,,,,True,,,False,False,,BXH10/TyJ,m,55423,0,1,-0.09
50137,HMDPpheno6,css,,50137,MeLAA,"liver 1-methylimidazoleacetate (16h fast), relative abundance",,,,,metabolite quantification,,HMDP w/par,m,16wks,animal,,2014,,,,91,37,,,,,True,,,False,False,,BXH10/TyJ,m,368551,0,1,5.25
50138,HMDPpheno6,css,,50138,His,"liver histidine (16h fast), relative abundance",,,,,metabolite quantification,,HMDP w/par,m,16wks,animal,,2014,,,,106,38,,,,,True,,,False,False,,BXH10/TyJ,m,459072,0,1,1.73
50139,HMDPpheno6,css,,50139,glutarate,"liver glutarate (pentanedioate) (16h fast), relative abundance",,,,,metabolite quantification,,HMDP w/par,m,16wks,animal,,2014,,,,100,39,,,,,True,,,False,False,,BXH10/TyJ,m,24656,0,1,-0.20
50140,HMDPpheno6,css,,50140,acetyl_Lys,"liver N2-acetyllysine (16h fast), relative abundance",,,,,metabolite quantification,,HMDP w/par,m,16wks,animal,,2014,,,,105,40,,,,,True,,,False,False,,BXH10/TyJ,m,88260,0,1,0.01
50141,HMDPpheno6,css,,50141,aminoadipate,"liver 2-aminoadipate (16h fast), relative abundance",,,,,metabolite quantification,,HMDP w/par,m,16wks,animal,,2014,,,,98,41,,,,,True,,,False,False,,BXH10/TyJ,m,326046,0,1,-0.22
50142,HMDPpheno6,css,,50142,GO_carnitine,"liver glutaroyl carnitine (16h fast), relative abundance",,,,,metabolite quantification,,HMDP w/par,m,16wks,animal,,2014,,,,106,42,,,,,True,,,False,False,,BXH10/TyJ,m,510703,0,1,-0.11
50143,HMDPpheno6,css,,50143,Lys,"liver lysine (16h fast), relative abundance",,,,,metabolite quantification,,HMDP w/par,m,16wks,animal,,2014,,,,106,43,,,,,True,,,False,False,,BXH10/TyJ,m,3117711,0,1,0.60
50144,HMDPpheno6,css,,50144,pipecolate,"liver pipecolate (16h fast), relative abundance",,,,,metabolite quantification,,HMDP w/par,m,16wks,animal,,2014,,,,106,44,,,,,True,,,False,False,,BXH10/TyJ,m,524014,0,1,0.51
50145,HMDPpheno6,css,,50145,Phe,"liver phenylalanine (16h fast), relative abundance",,,,,metabolite quantification,,HMDP w/par,m,16wks,animal,,2014,,,,106,45,,,,,True,,,False,False,,BXH10/TyJ,m,40530376,0,1,0.90
50146,HMDPpheno6,css,,50146,Tyr,"liver tyrosine (16h fast), relative abundance",,,,,metabolite quantification,,HMDP w/par,m,16wks,animal,,2014,,,,106,46,,,,,True,,,False,False,,BXH10/TyJ,m,9914593,0,1,0.11
50147,HMDPpheno6,css,,50147,HP_lactate,"liver 3-(4-hydroxyphenyl)lactate (16h fast), relative abundance",,,,,metabolite quantification,,HMDP w/par,m,16wks,animal,,2014,,,,106,47,,,,,True,,,False,False,,BXH10/TyJ,m,30352,0,1,0.62
50148,HMDPpheno6,css,,50148,PA_Gly,"liver phenylacetylglycine (16h fast), relative abundance",,,,,metabolite quantification,,HMDP w/par,m,16wks,animal,,2014,,,,105,48,,,,,True,,,False,False,,BXH10/TyJ,m,25454,0,1,0.30
50149,HMDPpheno6,css,,50149,phenol_sulfate,"liver phenol sulfate (16h fast), relative abundance",,,,,metabolite quantification,,HMDP w/par,m,16wks,animal,,2014,,,,103,49,,,,,True,,,False,False,,BXH10/TyJ,m,36876,0,1,0.23
50150,HMDPpheno6,css,,50150,MTA,"liver 5-methylthioadenosine (MTA) (16h fast), relative abundance",,,,,metabolite quantification,,HMDP w/par,m,16wks,animal,,2014,,,,106,50,,,,,True,,,False,False,,BXH10/TyJ,m,30870,0,1,-0.95