measnum,projsym,mpdsector,seriestype,keymeasnum,varname,descrip,descrip2,units,datatype,magnitude,method,intervention,paneldesc,sextested,ageweeks,granularity,sourceparm,projyear,extname,reference,association,nstrainstested,listorder,label,supplemental,native_method,is_covar,is_measure,upload_factors,file_column,is_baseline,is_control,private,strain,sex,mean,sd,nmice,zscore
42202,Donahue13,css,,42202,litter_interval,mean litter interval,,wks,,,colony observation,,CXB,f,3-50wks,animal,,2011,,,,13,2,,,,,True,,,False,False,,CXB7/ByJ,f,6.40,0.847,8,1.61
42203,Donahue13,css,,42203,litter_size_birth,mean number of pups born,,n,,,colony observation,,CXB,f,3-50wks,animal,,2011,,,,13,3,,,,,True,,,False,False,,CXB7/ByJ,f,6.69,1.99,8,0.39
42204,Donahue13,css,,42204,litter_size_wean,mean number of pups weaned,,n,,,colony observation,,CXB,f,3-50wks,animal,,2011,,,,13,4,,,,,True,,,False,False,,CXB7/ByJ,f,6.39,2.07,8,0.69
42205,Donahue13,css,,42205,ratio_wean_born,ratio of pups weaned to pups born,,ratio,,,colony observation,,CXB,f,3-50wks,animal,,2011,,,,13,5,,,,,True,,,False,False,,CXB7/ByJ,f,0.950,0.141,8,0.67
42206,Donahue13,css,,42206,fecundity_index,mean litter size divided by mean litter interval,,n/wks,,,colony observation,,CXB,f,3-50wks,animal,,2011,,,,13,6,,,,,True,,,False,False,,CXB7/ByJ,f,1.06,0.336,8,-0.80
42207,Donahue13,css,,42207,pct_Fwean,percent females at weaning,,%,,,colony observation,,CXB,f,3-50wks,animal,,2011,,,,13,7,,,,,True,,,False,False,,CXB7/ByJ,f,35.9,14.4,8,-2.19
48901,HMDPpheno5,css,,48901,WBC,white blood cell count (WBC; units per volume x 10<sup>3</sup>),,n/&micro;L,,3,complete blood count,,HMDP w/par,m,16wks,animal,,2013,,,,79,1,,,,,True,,,False,False,,CXB7/ByJ,m,6.83,2.14,7,1.80
48907,HMDPpheno5,css,,48907,LYM,lymphocyte count (LYM; units per volume x 10<sup>3</sup>),,n/&micro;L,,3,complete blood count,,HMDP w/par,m,16wks,animal,,2013,,,,79,7,,,,,True,,,False,False,,CXB7/ByJ,m,4.16,1.30,7,1.29
48913,HMDPpheno5,css,,48913,pct_LYM,lymphocyte differential (LYM; percentage of viable WBC),,%,,,complete blood count,,HMDP w/par,m,16wks,animal,,2013,,,,79,13,,,,,True,,,False,False,,CXB7/ByJ,m,61.6,2.81,7,-1.43
48919,HMDPpheno5,css,,48919,MONO,monocyte count (MONO; units per volume x 10<sup>3</sup>),,n/&micro;L,,3,complete blood count,,HMDP w/par,m,16wks,animal,,2013,,,,79,19,,,,,True,,,False,False,,CXB7/ByJ,m,0.871,0.229,7,3.49
48925,HMDPpheno5,css,,48925,pct_MONO,monocyte differential (MONO; percentage of viable WBC),,%,,,complete blood count,,HMDP w/par,m,16wks,animal,,2013,,,,79,25,,,,,True,,,False,False,,CXB7/ByJ,m,11.9,2.48,7,3.25
48931,HMDPpheno5,css,,48931,GRA,granulocyte count (GRA; units per volume x 10<sup>3</sup>),,n/&micro;L,,3,complete blood count,,HMDP w/par,m,16wks,animal,,2013,,,,79,31,,,,,True,,,False,False,,CXB7/ByJ,m,1.80,0.698,7,2.59
48937,HMDPpheno5,css,,48937,pct_GRA,granulocyte differential (GRA; percentage of total viable WBC),,%,,,complete blood count,,HMDP w/par,m,16wks,animal,,2013,,,,79,37,,,,,True,,,False,False,,CXB7/ByJ,m,26.5,2.74,7,0.55
48943,HMDPpheno5,css,,48943,RBC,red blood cell count (RBC; units per volume x 10<sup>6</sup>),,n/&micro;L,,6,complete blood count,,HMDP w/par,m,16wks,animal,,2013,,,,83,43,,,,,True,,,False,False,,CXB7/ByJ,m,11.2,0.237,7,1.80
48949,HMDPpheno5,css,,48949,MCV,mean RBC corpuscular volume (MCV),,fL,,,complete blood count,,HMDP w/par,m,16wks,animal,,2013,,,,83,49,,,,,True,,,False,False,,CXB7/ByJ,m,40.2,0.522,7,-1.10
48955,HMDPpheno5,css,,48955,RDW,RBC corpuscular distribution width (RDW),,%,,,complete blood count,,HMDP w/par,m,16wks,animal,,2013,,,,83,55,,,,,True,,,False,False,,CXB7/ByJ,m,18.2,0.287,7,0.95
48961,HMDPpheno5,css,,48961,MCH,mean RBC corpuscular hemoglobin (MCH),,pg,,,complete blood count,,HMDP w/par,m,16wks,animal,,2013,,,,83,61,,,,,True,,,False,False,,CXB7/ByJ,m,14.6,0.298,7,-0.60
48967,HMDPpheno5,css,,48967,MCHC,mean RBC corpuscular hemoglobin concentration (MCHC),,g/dL,,,complete blood count,,HMDP w/par,m,16wks,animal,,2013,,,,83,67,,,,,True,,,False,False,,CXB7/ByJ,m,36.5,0.519,7,0.73
48973,HMDPpheno5,css,,48973,HGB,hemoglobin (HGB),,g/dL,,,complete blood count,,HMDP w/par,m,16wks,animal,,2013,,,,83,73,,,,,True,,,False,False,,CXB7/ByJ,m,16.4,0.283,7,1.85
48979,HMDPpheno5,css,,48979,HCT,hematocrit (HCT),,%,,,complete blood count,,HMDP w/par,m,16wks,animal,,2013,,,,83,79,,,,,True,,,False,False,,CXB7/ByJ,m,45.0,0.608,7,0.99
48985,HMDPpheno5,css,,48985,PLT,platelet count (PLT; units per volume x 10<sup>3</sup>),,n/&micro;L,,3,complete blood count,,HMDP w/par,m,16wks,animal,,2013,,,,83,85,,,,,True,,,False,False,,CXB7/ByJ,m,320,126,7,0.41
48991,HMDPpheno5,css,,48991,MPV,mean platelet volume (MPV),,fL,,,complete blood count,,HMDP w/par,m,16wks,animal,,2013,,,,83,91,,,,,True,,,False,False,,CXB7/ByJ,m,5.89,0.168,7,-0.81
50101,HMDPpheno6,css,,50101,Ala,"liver alanine (16h fast), relative abundance",,,,,metabolite quantification,,HMDP w/par,m,16wks,animal,,2014,,,,106,1,,,,,True,,,False,False,,CXB7/ByJ,m,80396168,3867071,2,0.59
50102,HMDPpheno6,css,,50102,Asn,"liver asparagine (16h fast), relative abundance",,,,,metabolite quantification,,HMDP w/par,m,16wks,animal,,2014,,,,106,2,,,,,True,,,False,False,,CXB7/ByJ,m,427763,91445,2,1.13
50103,HMDPpheno6,css,,50103,Asp,"liver aspartate (16h fast), relative abundance",,,,,metabolite quantification,,HMDP w/par,m,16wks,animal,,2014,,,,106,3,,,,,True,,,False,False,,CXB7/ByJ,m,12310306,2617247,2,-0.02
50104,HMDPpheno6,css,,50104,beta_Ala,"liver beta-alanine (16h fast), relative abundance",,,,,metabolite quantification,,HMDP w/par,m,16wks,animal,,2014,,,,106,4,,,,,True,,,False,False,,CXB7/ByJ,m,721359,3109,2,-0.01
50105,HMDPpheno6,css,,50105,acetyl_Asn,"liver N-acetylasparagine (16h fast), relative abundance",,,,,metabolite quantification,,HMDP w/par,m,16wks,animal,,2014,,,,103,5,,,,,True,,,False,False,,CXB7/ByJ,m,50663,18844,2,-0.66
50106,HMDPpheno6,css,,50106,acetyl_Ala,"liver N-acetylalanine (16h fast), relative abundance",,,,,metabolite quantification,,HMDP w/par,m,16wks,animal,,2014,,,,104,6,,,,,True,,,False,False,,CXB7/ByJ,m,34321,4515,2,2.14
50107,HMDPpheno6,css,,50107,aminobutyrate,"liver 2-aminobutyrate (16h fast), relative abundance",,,,,metabolite quantification,,HMDP w/par,m,16wks,animal,,2014,,,,106,7,,,,,True,,,False,False,,CXB7/ByJ,m,1381936,327943,2,-0.27
50108,HMDPpheno6,css,,50108,creatine,"liver creatine (16h fast), relative abundance",,,,,metabolite quantification,,HMDP w/par,m,16wks,animal,,2014,,,,106,8,,,,,True,,,False,False,,CXB7/ByJ,m,2913105,13641,2,-1.10
50109,HMDPpheno6,css,,50109,AHB,"liver 2-hydroxybutyrate (AHB) (16h fast), relative abundance",,,,,metabolite quantification,,HMDP w/par,m,16wks,animal,,2014,,,,99,9,,,,,True,,,False,False,,CXB7/ByJ,m,199979,45783,2,0.03
50110,HMDPpheno6,css,,50110,Cys,"liver cysteine (16h fast), relative abundance",,,,,metabolite quantification,,HMDP w/par,m,16wks,animal,,2014,,,,106,10,,,,,True,,,False,False,,CXB7/ByJ,m,1506269,176998,2,0.50
50111,HMDPpheno6,css,,50111,hypotaurine,"liver hypotaurine (16h fast), relative abundance",,,,,metabolite quantification,,HMDP w/par,m,16wks,animal,,2014,,,,106,11,,,,,True,,,False,False,,CXB7/ByJ,m,1026685,221483,2,-0.46
50112,HMDPpheno6,css,,50112,Met,"liver methionine (16h fast), relative abundance",,,,,metabolite quantification,,HMDP w/par,m,16wks,animal,,2014,,,,106,12,,,,,True,,,False,False,,CXB7/ByJ,m,7461507,659512,2,0.32
50113,HMDPpheno6,css,,50113,Met_sulf,"liver methionine sulfoxide (16h fast), relative abundance",,,,,metabolite quantification,,HMDP w/par,m,16wks,animal,,2014,,,,104,13,,,,,True,,,False,False,,CXB7/ByJ,m,136169,35146,2,-0.51
50114,HMDPpheno6,css,,50114,taurine,"liver taurine (16h fast), relative abundance",,,,,metabolite quantification,,HMDP w/par,m,16wks,animal,,2014,,,,106,14,,,,,True,,,False,False,,CXB7/ByJ,m,785240,8278,2,-1.77
50115,HMDPpheno6,css,,50115,acetyl_Met,"liver N-acetylmethionine (16h fast), relative abundance",,,,,metabolite quantification,,HMDP w/par,m,16wks,animal,,2014,,,,106,15,,,,,True,,,False,False,,CXB7/ByJ,m,42174,3334,2,2.56
50116,HMDPpheno6,css,,50116,SAH,"liver S-adenosylhomocysteine (SAH) (16h fast), relative abundance",,,,,metabolite quantification,,HMDP w/par,m,16wks,animal,,2014,,,,106,16,,,,,True,,,False,False,,CXB7/ByJ,m,31294,1788,2,-1.02
50117,HMDPpheno6,css,,50117,GABA,"liver gamma-aminobutyrate (GABA) (16h fast), relative abundance",,,,,metabolite quantification,,HMDP w/par,m,16wks,animal,,2014,,,,106,17,,,,,True,,,False,False,,CXB7/ByJ,m,585732,83208,2,1.16
50118,HMDPpheno6,css,,50118,acetyl_Glu,"liver N-acetylglutamate (16h fast), relative abundance",,,,,metabolite quantification,,HMDP w/par,m,16wks,animal,,2014,,,,106,18,,,,,True,,,False,False,,CXB7/ByJ,m,122256,32204,2,-0.34
50119,HMDPpheno6,css,,50119,Gln,"liver glutamine (16h fast), relative abundance",,,,,metabolite quantification,,HMDP w/par,m,16wks,animal,,2014,,,,106,19,,,,,True,,,False,False,,CXB7/ByJ,m,12903844,345453,2,0.74
50120,HMDPpheno6,css,,50120,Glu,"liver glutamate (16h fast), relative abundance",,,,,metabolite quantification,,HMDP w/par,m,16wks,animal,,2014,,,,106,20,,,,,True,,,False,False,,CXB7/ByJ,m,4816804,572582,2,-0.62
50121,HMDPpheno6,css,,50121,CySSG,"liver cysteine-glutathione disulfide (16h fast), relative abundance",,,,,metabolite quantification,,HMDP w/par,m,16wks,animal,,2014,,,,106,21,,,,,True,,,False,False,,CXB7/ByJ,m,2291070,290100,2,0.18
50122,HMDPpheno6,css,,50122,GSH,"liver glutathione, reduced (GSH) (16h fast), relative abundance",,,,,metabolite quantification,,HMDP w/par,m,16wks,animal,,2014,,,,104,22,,,,,True,,,False,False,,CXB7/ByJ,m,397571,183845,2,0.85
50123,HMDPpheno6,css,,50123,GSSG,"liver glutathione, oxidized (GSSG) (16h fast), relative abundance",,,,,metabolite quantification,,HMDP w/par,m,16wks,animal,,2014,,,,106,23,,,,,True,,,False,False,,CXB7/ByJ,m,12493698,120561,2,0.18
50124,HMDPpheno6,css,,50124,Me_glutathione,"liver S-methylglutathione (16h fast), relative abundance",,,,,metabolite quantification,,HMDP w/par,m,16wks,animal,,2014,,,,106,24,,,,,True,,,False,False,,CXB7/ByJ,m,270337,31786,2,1.40
50125,HMDPpheno6,css,,50125,ophthalmate,"liver ophthalmate (16h fast), relative abundance",,,,,metabolite quantification,,HMDP w/par,m,16wks,animal,,2014,,,,106,25,,,,,True,,,False,False,,CXB7/ByJ,m,899012,719215,2,-0.16
50126,HMDPpheno6,css,,50126,oxoproline,"liver 5-oxoproline (16h fast), relative abundance",,,,,metabolite quantification,,HMDP w/par,m,16wks,animal,,2014,,,,106,26,,,,,True,,,False,False,,CXB7/ByJ,m,166983,12376,2,-0.52
50127,HMDPpheno6,css,,50127,acetyl_Gly,"liver N-acetylglycine (16h fast), relative abundance",,,,,metabolite quantification,,HMDP w/par,m,16wks,animal,,2014,,,,96,27,,,,,True,,,False,False,,CXB7/ByJ,m,111218,14411,2,2.06
50128,HMDPpheno6,css,,50128,diMe_Gly,"liver dimethylglycine (16h fast), relative abundance",,,,,metabolite quantification,,HMDP w/par,m,16wks,animal,,2014,,,,96,28,,,,,True,,,False,False,,CXB7/ByJ,m,269690,17664,2,0.06
50129,HMDPpheno6,css,,50129,Gly,"liver glycine (16h fast), relative abundance",,,,,metabolite quantification,,HMDP w/par,m,16wks,animal,,2014,,,,106,29,,,,,True,,,False,False,,CXB7/ByJ,m,38342310,2017090,2,0.68
50130,HMDPpheno6,css,,50130,homo_Ser,"liver homoserine (16h fast), relative abundance",,,,,metabolite quantification,,HMDP w/par,m,16wks,animal,,2014,,,,104,30,,,,,True,,,False,False,,CXB7/ByJ,m,22646,0,1,-0.88
50131,HMDPpheno6,css,,50131,Ser,"liver serine (16h fast), relative abundance",,,,,metabolite quantification,,HMDP w/par,m,16wks,animal,,2014,,,,106,31,,,,,True,,,False,False,,CXB7/ByJ,m,32838324,868064,2,0.66
50132,HMDPpheno6,css,,50132,Thr,"liver threonine (16h fast), relative abundance",,,,,metabolite quantification,,HMDP w/par,m,16wks,animal,,2014,,,,106,32,,,,,True,,,False,False,,CXB7/ByJ,m,9736912,181330,2,0.62
50133,HMDPpheno6,css,,50133,betaine,"liver betaine (16h fast), relative abundance",,,,,metabolite quantification,,HMDP w/par,m,16wks,animal,,2014,,,,106,33,,,,,True,,,False,False,,CXB7/ByJ,m,7006009,1500981,2,0.35
50134,HMDPpheno6,css,,50134,betaine_aldehyde,"liver betaine aldehyde (16h fast), relative abundance",,,,,metabolite quantification,,HMDP w/par,m,16wks,animal,,2014,,,,106,34,,,,,True,,,False,False,,CXB7/ByJ,m,1291533,234444,2,-1.06
50135,HMDPpheno6,css,,50135,MeC_Gly,"liver 3-methylcrotonylglycine (16h fast), relative abundance",,,,,metabolite quantification,,HMDP w/par,m,16wks,animal,,2014,,,,98,35,,,,,True,,,False,False,,CXB7/ByJ,m,22425,2220,2,-1.05
50136,HMDPpheno6,css,,50136,guanidino,"liver 4-guanidinobutanoate (16h fast), relative abundance",,,,,metabolite quantification,,HMDP w/par,m,16wks,animal,,2014,,,,94,36,,,,,True,,,False,False,,CXB7/ByJ,m,20334,0,1,-0.50
50137,HMDPpheno6,css,,50137,MeLAA,"liver 1-methylimidazoleacetate (16h fast), relative abundance",,,,,metabolite quantification,,HMDP w/par,m,16wks,animal,,2014,,,,91,37,,,,,True,,,False,False,,CXB7/ByJ,m,57402,11305,2,-0.21
50138,HMDPpheno6,css,,50138,His,"liver histidine (16h fast), relative abundance",,,,,metabolite quantification,,HMDP w/par,m,16wks,animal,,2014,,,,106,38,,,,,True,,,False,False,,CXB7/ByJ,m,322234,32701,2,-0.14
50139,HMDPpheno6,css,,50139,glutarate,"liver glutarate (pentanedioate) (16h fast), relative abundance",,,,,metabolite quantification,,HMDP w/par,m,16wks,animal,,2014,,,,100,39,,,,,True,,,False,False,,CXB7/ByJ,m,21033,0,1,-0.22
50140,HMDPpheno6,css,,50140,acetyl_Lys,"liver N2-acetyllysine (16h fast), relative abundance",,,,,metabolite quantification,,HMDP w/par,m,16wks,animal,,2014,,,,105,40,,,,,True,,,False,False,,CXB7/ByJ,m,43061,3954,2,-1.12
50141,HMDPpheno6,css,,50141,aminoadipate,"liver 2-aminoadipate (16h fast), relative abundance",,,,,metabolite quantification,,HMDP w/par,m,16wks,animal,,2014,,,,98,41,,,,,True,,,False,False,,CXB7/ByJ,m,206631,87634,2,-0.24
50142,HMDPpheno6,css,,50142,GO_carnitine,"liver glutaroyl carnitine (16h fast), relative abundance",,,,,metabolite quantification,,HMDP w/par,m,16wks,animal,,2014,,,,106,42,,,,,True,,,False,False,,CXB7/ByJ,m,719656,24856,2,-0.02
50143,HMDPpheno6,css,,50143,Lys,"liver lysine (16h fast), relative abundance",,,,,metabolite quantification,,HMDP w/par,m,16wks,animal,,2014,,,,106,43,,,,,True,,,False,False,,CXB7/ByJ,m,2821780,74445,2,-0.02
50144,HMDPpheno6,css,,50144,pipecolate,"liver pipecolate (16h fast), relative abundance",,,,,metabolite quantification,,HMDP w/par,m,16wks,animal,,2014,,,,106,44,,,,,True,,,False,False,,CXB7/ByJ,m,269220,5871,2,-0.75
50145,HMDPpheno6,css,,50145,Phe,"liver phenylalanine (16h fast), relative abundance",,,,,metabolite quantification,,HMDP w/par,m,16wks,animal,,2014,,,,106,45,,,,,True,,,False,False,,CXB7/ByJ,m,40414834,6318443,2,0.88
50146,HMDPpheno6,css,,50146,Tyr,"liver tyrosine (16h fast), relative abundance",,,,,metabolite quantification,,HMDP w/par,m,16wks,animal,,2014,,,,106,46,,,,,True,,,False,False,,CXB7/ByJ,m,11999690,2051045,2,0.89
50147,HMDPpheno6,css,,50147,HP_lactate,"liver 3-(4-hydroxyphenyl)lactate (16h fast), relative abundance",,,,,metabolite quantification,,HMDP w/par,m,16wks,animal,,2014,,,,106,47,,,,,True,,,False,False,,CXB7/ByJ,m,31271,2334,2,0.75
50148,HMDPpheno6,css,,50148,PA_Gly,"liver phenylacetylglycine (16h fast), relative abundance",,,,,metabolite quantification,,HMDP w/par,m,16wks,animal,,2014,,,,105,48,,,,,True,,,False,False,,CXB7/ByJ,m,38234,10966,2,1.37
50149,HMDPpheno6,css,,50149,phenol_sulfate,"liver phenol sulfate (16h fast), relative abundance",,,,,metabolite quantification,,HMDP w/par,m,16wks,animal,,2014,,,,103,49,,,,,True,,,False,False,,CXB7/ByJ,m,22166,18467,2,-0.44
50150,HMDPpheno6,css,,50150,MTA,"liver 5-methylthioadenosine (MTA) (16h fast), relative abundance",,,,,metabolite quantification,,HMDP w/par,m,16wks,animal,,2014,,,,106,50,,,,,True,,,False,False,,CXB7/ByJ,m,147044,18074,2,3.28
50151,HMDPpheno6,css,,50151,spermidine,"liver spermidine (16h fast), relative abundance",,,,,metabolite quantification,,HMDP w/par,m,16wks,animal,,2014,,,,106,51,,,,,True,,,False,False,,CXB7/ByJ,m,172257,23724,2,-1.02
50152,HMDPpheno6,css,,50152,anthranilate,"liver anthranilate (16h fast), relative abundance",,,,,metabolite quantification,,HMDP w/par,m,16wks,animal,,2014,,,,105,52,,,,,True,,,False,False,,CXB7/ByJ,m,64832,15818,2,-0.28
50153,HMDPpheno6,css,,50153,glycosyl_Trp,"liver C-glycosyltryptophan (16h fast), relative abundance",,,,,metabolite quantification,,HMDP w/par,m,16wks,animal,,2014,,,,106,53,,,,,True,,,False,False,,CXB7/ByJ,m,170070,14138,2,0.32
50154,HMDPpheno6,css,,50154,kynurenine,"liver kynurenine (16h fast), relative abundance",,,,,metabolite quantification,,HMDP w/par,m,16wks,animal,,2014,,,,106,54,,,,,True,,,False,False,,CXB7/ByJ,m,173584,38275,2,-0.56
50155,HMDPpheno6,css,,50155,Trp,"liver tryptophan (16h fast), relative abundance",,,,,metabolite quantification,,HMDP w/par,m,16wks,animal,,2014,,,,106,55,,,,,True,,,False,False,,CXB7/ByJ,m,7464825,636478,2,0.42
50156,HMDPpheno6,css,,50156,kynurenate,"liver kynurenate (16h fast), relative abundance",,,,,metabolite quantification,,HMDP w/par,m,16wks,animal,,2014,,,,105,56,,,,,True,,,False,False,,CXB7/ByJ,m,5421,2341,2,-1.15
50157,HMDPpheno6,css,,50157,hydroxy_Pro,"liver trans-4-hydroxyproline (16h fast), relative abundance",,,,,metabolite quantification,,HMDP w/par,m,16wks,animal,,2014,,,,103,57,,,,,True,,,False,False,,CXB7/ByJ,m,115596,18845,2,-0.68
50158,HMDPpheno6,css,,50158,ornithine,"liver ornithine (16h fast), relative abundance",,,,,metabolite quantification,,HMDP w/par,m,16wks,animal,,2014,,,,106,58,,,,,True,,,False,False,,CXB7/ByJ,m,4187162,950515,2,-0.36
50159,HMDPpheno6,css,,50159,urea,"liver urea (16h fast), relative abundance",,,,,metabolite quantification,,HMDP w/par,m,16wks,animal,,2014,,,,106,59,,,,,True,,,False,False,,CXB7/ByJ,m,2220387,250252,2,0.27
50160,HMDPpheno6,css,,50160,acetylornithine,"liver N-acetylornithine (16h fast), relative abundance",,,,,metabolite quantification,,HMDP w/par,m,16wks,animal,,2014,,,,103,60,,,,,True,,,False,False,,CXB7/ByJ,m,46445,10582,2,-1.11
50161,HMDPpheno6,css,,50161,aminovalerate,"liver 5-aminovalerate (16h fast), relative abundance",,,,,metabolite quantification,,HMDP w/par,m,16wks,animal,,2014,,,,106,61,,,,,True,,,False,False,,CXB7/ByJ,m,482165,68439,2,-0.80
50162,HMDPpheno6,css,,50162,citrulline,"liver citrulline (16h fast), relative abundance",,,,,metabolite quantification,,HMDP w/par,m,16wks,animal,,2014,,,,106,62,,,,,True,,,False,False,,CXB7/ByJ,m,324706,57697,2,0.57
50163,HMDPpheno6,css,,50163,homostachydrine,"liver homostachydrine (16h fast), relative abundance",,,,,metabolite quantification,,HMDP w/par,m,16wks,animal,,2014,,,,105,63,,,,,True,,,False,False,,CXB7/ByJ,m,164586,36416,2,-0.35
50164,HMDPpheno6,css,,50164,Pro,"liver proline (16h fast), relative abundance",,,,,metabolite quantification,,HMDP w/par,m,16wks,animal,,2014,,,,106,64,,,,,True,,,False,False,,CXB7/ByJ,m,10392816,760874,2,0.98
50165,HMDPpheno6,css,,50165,SMDA_ADMA,"liver dimethylarginine (SDMA + ADMA) (16h fast), relative abundance",,,,,metabolite quantification,,HMDP w/par,m,16wks,animal,,2014,,,,106,65,,,,,True,,,False,False,,CXB7/ByJ,m,904611,18647,2,-0.27
50166,HMDPpheno6,css,,50166,stachydrine,"liver stachydrine (16h fast), relative abundance",,,,,metabolite quantification,,HMDP w/par,m,16wks,animal,,2014,,,,104,66,,,,,True,,,False,False,,CXB7/ByJ,m,259452,133253,2,0.17
50167,HMDPpheno6,css,,50167,HV_carnitine,"liver hydroxyisovaleroyl carnitine (16h fast), relative abundance",,,,,metabolite quantification,,HMDP w/par,m,16wks,animal,,2014,,,,104,67,,,,,True,,,False,False,,CXB7/ByJ,m,149270,24533,2,-1.16
50168,HMDPpheno6,css,,50168,IB_carnitine,"liver isobutyrylcarnitine (16h fast), relative abundance",,,,,metabolite quantification,,HMDP w/par,m,16wks,animal,,2014,,,,106,68,,,,,True,,,False,False,,CXB7/ByJ,m,74539,18685,2,-0.90
50169,HMDPpheno6,css,,50169,Ile,"liver isoleucine (16h fast), relative abundance",,,,,metabolite quantification,,HMDP w/par,m,16wks,animal,,2014,,,,106,69,,,,,True,,,False,False,,CXB7/ByJ,m,20475500,1331097,2,0.39
50170,HMDPpheno6,css,,50170,IV_carnitine,"liver isovalerylcarnitine (16h fast), relative abundance",,,,,metabolite quantification,,HMDP w/par,m,16wks,animal,,2014,,,,106,70,,,,,True,,,False,False,,CXB7/ByJ,m,72880,15400,2,-0.87
50171,HMDPpheno6,css,,50171,IV_Gly,"liver isovalerylglycine (16h fast), relative abundance",,,,,metabolite quantification,,HMDP w/par,m,16wks,animal,,2014,,,,106,71,,,,,True,,,False,False,,CXB7/ByJ,m,99288,23240,2,-0.55
50172,HMDPpheno6,css,,50172,Leu,"liver leucine (16h fast), relative abundance",,,,,metabolite quantification,,HMDP w/par,m,16wks,animal,,2014,,,,106,72,,,,,True,,,False,False,,CXB7/ByJ,m,44051790,3026341,2,0.60
50173,HMDPpheno6,css,,50173,MeB_carnitine,"liver 2-methylbutyroylcarnitine (16h fast), relative abundance",,,,,metabolite quantification,,HMDP w/par,m,16wks,animal,,2014,,,,105,73,,,,,True,,,False,False,,CXB7/ByJ,m,126724,46824,2,-0.75
50174,HMDPpheno6,css,,50174,MeG_carnitine,"liver methylglutaroylcarnitine (16h fast), relative abundance",,,,,metabolite quantification,,HMDP w/par,m,16wks,animal,,2014,,,,106,74,,,,,True,,,False,False,,CXB7/ByJ,m,835296,113838,2,-0.81
50175,HMDPpheno6,css,,50175,tigloyl_Gly,"liver tigloylglycine (16h fast), relative abundance",,,,,metabolite quantification,,HMDP w/par,m,16wks,animal,,2014,,,,92,75,,,,,True,,,False,False,,CXB7/ByJ,m,54540,10327,2,1.16
50176,HMDPpheno6,css,,50176,tiglyl_carnitine,"liver tiglyl carnitine (16h fast), relative abundance",,,,,metabolite quantification,,HMDP w/par,m,16wks,animal,,2014,,,,106,76,,,,,True,,,False,False,,CXB7/ByJ,m,118506,8955,2,-0.77
50177,HMDPpheno6,css,,50177,Val,"liver valine (16h fast), relative abundance",,,,,metabolite quantification,,HMDP w/par,m,16wks,animal,,2014,,,,106,77,,,,,True,,,False,False,,CXB7/ByJ,m,22507145,2002268,2,0.46
50178,HMDPpheno6,css,,50178,MMA,"liver methylmalonate (MMA) (16h fast), relative abundance",,,,,metabolite quantification,,HMDP w/par,m,16wks,animal,,2014,,,,106,78,,,,,True,,,False,False,,CXB7/ByJ,m,20492,1173,2,-0.35
50201,HMDPpheno7,css,,50201,erythronate,"liver erythronate (16h fast), relative abundance",,,,,metabolite quantification,,HMDP,m,16wks,animal,,2014,,,,102,1,,,,,True,,,False,False,,CXB7/ByJ,m,29218,9842,2,-0.27
50202,HMDPpheno7,css,,50202,glucosamine,"liver glucosamine (16h fast), relative abundance",,,,,metabolite quantification,,HMDP,m,16wks,animal,,2014,,,,93,2,,,,,True,,,False,False,,CXB7/ByJ,m,136956,38571,2,-0.10
50203,HMDPpheno7,css,,50203,erythrose,"liver erythrose (16h fast), relative abundance",,,,,metabolite quantification,,HMDP,m,16wks,animal,,2014,,,,106,3,,,,,True,,,False,False,,CXB7/ByJ,m,265034,96537,2,0.55
50204,HMDPpheno7,css,,50204,fructose,"liver fructose (16h fast), relative abundance",,,,,metabolite quantification,,HMDP,m,16wks,animal,,2014,,,,106,4,,,,,True,,,False,False,,CXB7/ByJ,m,1801376,149118,2,0.44
50205,HMDPpheno7,css,,50205,maltose,"liver maltose (16h fast), relative abundance",,,,,metabolite quantification,,HMDP,m,16wks,animal,,2014,,,,94,5,,,,,True,,,False,False,,CXB7/ByJ,m,36481235,17949845,2,0.20
50206,HMDPpheno7,css,,50206,mannose,"liver mannose (16h fast), relative abundance",,,,,metabolite quantification,,HMDP,m,16wks,animal,,2014,,,,106,6,,,,,True,,,False,False,,CXB7/ByJ,m,19618175,3856748,2,0.12
50207,HMDPpheno7,css,,50207,sorbitol,"liver sorbitol (16h fast), relative abundance",,,,,metabolite quantification,,HMDP,m,16wks,animal,,2014,,,,106,7,,,,,True,,,False,False,,CXB7/ByJ,m,380763,175529,2,0.09
50208,HMDPpheno7,css,,50208,maltotetraose,"liver maltotetraose (16h fast), relative abundance",,,,,metabolite quantification,,HMDP,m,16wks,animal,,2014,,,,100,8,,,,,True,,,False,False,,CXB7/ByJ,m,189242,20868,2,-0.02